BDBM50386700 CHEMBL2048907
SMILES: CC(C)(O)C(=O)NCCn1ccc2ncnc(Nc3ccc(Oc4cccc5sncc45)c(Cl)c3)c12
InChI Key: InChIKey=SEHAPCZLZSSPLF-UHFFFAOYSA-N
Data: 2 IC50
Activity Spreadsheet -- Enzyme Inhibition Constant Data from BindingDB
Found 2 hits for monomerid = 50386700
Trg + Lig
Ki
nM
ΔG°
kcal/mole
IC50
nM
Kd
nM
EC50/IC50
nM
koff
s-1
kon
M-1s-1
pHTemp
°C
Receptor tyrosine-protein kinase erbB-2
(Homo sapiens (Human))
BDBM50386700
(CHEMBL2048907)
Show SMILES CC(C)(O)C(=O)NCCn1ccc2ncnc(Nc3ccc(Oc4cccc5sncc45)c(Cl)c3)c12
Show InChI InChI=1S/C25H23ClN6O3S/c1-25(2,34)24(33)27-9-11-32-10-8-18-22(32)23(29-14-28-18)31-15-6-7-20(17(26)12-15)35-19-4-3-5-21-16(19)13-30-36-21/h3-8,10,12-14,34H,9,11H2,1-2H3,(H,27,33)(H,28,29,31)
n/an/a 2.20n/an/an/an/an/an/a
Takeda Pharmaceutical Company Limited
Curated by ChEMBL
Assay Description
Inhibition of N-terminus peptide-tagged human recombinant HER2 expressed using baculovirus infection system using [gamma-33P]-ATP preincubated with c...
J Med Chem 55: 3975-91 (2012)
Article DOI: 10.1021/jm300185p
BindingDB Entry DOI: 10.7270/Q2474BX1
Epidermal growth factor receptor
(Homo sapiens (Human))
BDBM50386700
(CHEMBL2048907)
Show SMILES CC(C)(O)C(=O)NCCn1ccc2ncnc(Nc3ccc(Oc4cccc5sncc45)c(Cl)c3)c12
Show InChI InChI=1S/C25H23ClN6O3S/c1-25(2,34)24(33)27-9-11-32-10-8-18-22(32)23(29-14-28-18)31-15-6-7-20(17(26)12-15)35-19-4-3-5-21-16(19)13-30-36-21/h3-8,10,12-14,34H,9,11H2,1-2H3,(H,27,33)(H,28,29,31)
n/an/a 7n/an/an/an/an/an/a
Takeda Pharmaceutical Company Limited
Curated by ChEMBL
Assay Description
Inhibition of N-terminus peptide-tagged human recombinant EGFR expressed using baculovirus infection system using [gamma-33P]-ATP preincubated with c...
J Med Chem 55: 3975-91 (2012)
Article DOI: 10.1021/jm300185p
BindingDB Entry DOI: 10.7270/Q2474BX1