BDBM50386706 CHEMBL2048797
SMILES: OCCn1ccc2ncnc(Nc3ccc(Oc4cccc5[nH]ccc45)c(Cl)c3)c12
InChI Key: InChIKey=GSDQZJWVOBCWHP-UHFFFAOYSA-N
Data: 2 IC50
Activity Spreadsheet -- Enzyme Inhibition Constant Data from BindingDB
Found 2 hits for monomerid = 50386706
Trg + Lig
Ki
nM
ΔG°
kcal/mole
IC50
nM
Kd
nM
EC50/IC50
nM
koff
s-1
kon
M-1s-1
pHTemp
°C
Receptor tyrosine-protein kinase erbB-2
(Homo sapiens (Human))
BDBM50386706
(CHEMBL2048797)
Show SMILES OCCn1ccc2ncnc(Nc3ccc(Oc4cccc5[nH]ccc45)c(Cl)c3)c12
Show InChI InChI=1S/C22H18ClN5O2/c23-16-12-14(27-22-21-18(25-13-26-22)7-9-28(21)10-11-29)4-5-20(16)30-19-3-1-2-17-15(19)6-8-24-17/h1-9,12-13,24,29H,10-11H2,(H,25,26,27)
n/an/a 2.5n/an/an/an/an/an/a
Takeda Pharmaceutical Company Limited
Curated by ChEMBL
Assay Description
Inhibition of N-terminus peptide-tagged human recombinant HER2 expressed using baculovirus infection system using [gamma-33P]-ATP preincubated with c...
J Med Chem 55: 3975-91 (2012)
Article DOI: 10.1021/jm300185p
BindingDB Entry DOI: 10.7270/Q2474BX1
Epidermal growth factor receptor
(Homo sapiens (Human))
BDBM50386706
(CHEMBL2048797)
Show SMILES OCCn1ccc2ncnc(Nc3ccc(Oc4cccc5[nH]ccc45)c(Cl)c3)c12
Show InChI InChI=1S/C22H18ClN5O2/c23-16-12-14(27-22-21-18(25-13-26-22)7-9-28(21)10-11-29)4-5-20(16)30-19-3-1-2-17-15(19)6-8-24-17/h1-9,12-13,24,29H,10-11H2,(H,25,26,27)
n/an/a 3.10n/an/an/an/an/an/a
Takeda Pharmaceutical Company Limited
Curated by ChEMBL
Assay Description
Inhibition of N-terminus peptide-tagged human recombinant EGFR expressed using baculovirus infection system using [gamma-33P]-ATP preincubated with c...
J Med Chem 55: 3975-91 (2012)
Article DOI: 10.1021/jm300185p
BindingDB Entry DOI: 10.7270/Q2474BX1