BDBM50386711 CHEMBL2048792
SMILES: OCCn1ccc2ncnc(Nc3ccc(Oc4ccc5CC(=O)Nc5c4)c(Cl)c3)c12
InChI Key: InChIKey=IKXDZCIRCQRTQF-UHFFFAOYSA-N
Data: 2 IC50
Activity Spreadsheet -- Enzyme Inhibition Constant Data from BindingDB
Found 2 hits for monomerid = 50386711
Trg + Lig
Ki
nM
ΔG°
kcal/mole
IC50
nM
Kd
nM
EC50/IC50
nM
koff
s-1
kon
M-1s-1
pHTemp
°C
Receptor tyrosine-protein kinase erbB-2
(Homo sapiens (Human))
BDBM50386711
(CHEMBL2048792)
Show SMILES OCCn1ccc2ncnc(Nc3ccc(Oc4ccc5CC(=O)Nc5c4)c(Cl)c3)c12
Show InChI InChI=1S/C22H18ClN5O3/c23-16-10-14(26-22-21-17(24-12-25-22)5-6-28(21)7-8-29)2-4-19(16)31-15-3-1-13-9-20(30)27-18(13)11-15/h1-6,10-12,29H,7-9H2,(H,27,30)(H,24,25,26)
n/an/a 130n/an/an/an/an/an/a
Takeda Pharmaceutical Company Limited
Curated by ChEMBL
Assay Description
Inhibition of N-terminus peptide-tagged human recombinant HER2 expressed using baculovirus infection system using [gamma-33P]-ATP preincubated with c...
J Med Chem 55: 3975-91 (2012)
Article DOI: 10.1021/jm300185p
BindingDB Entry DOI: 10.7270/Q2474BX1
Epidermal growth factor receptor
(Homo sapiens (Human))
BDBM50386711
(CHEMBL2048792)
Show SMILES OCCn1ccc2ncnc(Nc3ccc(Oc4ccc5CC(=O)Nc5c4)c(Cl)c3)c12
Show InChI InChI=1S/C22H18ClN5O3/c23-16-10-14(26-22-21-17(24-12-25-22)5-6-28(21)7-8-29)2-4-19(16)31-15-3-1-13-9-20(30)27-18(13)11-15/h1-6,10-12,29H,7-9H2,(H,27,30)(H,24,25,26)
n/an/a 2.30E+3n/an/an/an/an/an/a
Takeda Pharmaceutical Company Limited
Curated by ChEMBL
Assay Description
Inhibition of N-terminus peptide-tagged human recombinant EGFR expressed using baculovirus infection system using [gamma-33P]-ATP preincubated with c...
J Med Chem 55: 3975-91 (2012)
Article DOI: 10.1021/jm300185p
BindingDB Entry DOI: 10.7270/Q2474BX1