null
SMILES: O=C(Nc1nnc(Sc2ncnc3cc(OCCCN4CCOCC4)ccc23)s1)Nc1cccc(c1)C#C
InChI Key: InChIKey=SSPVPZDWZWZEAN-UHFFFAOYSA-N
Activity Spreadsheet -- Enzyme Inhibition Constant Data from BindingDB
Found 1 hit for monomerid = 50386751
Trg + Lig
Ki
nM
ΔG°
kcal/mole
IC50
nM
Kd
nM
EC50/IC50
nM
koff
s-1
kon
M-1s-1
pHTemp
°C
Receptor-type tyrosine-protein kinase FLT3
(Homo sapiens (Human))
BDBM50386751
(CHEMBL2046884)
Show SMILES O=C(Nc1nnc(Sc2ncnc3cc(OCCCN4CCOCC4)ccc23)s1)Nc1cccc(c1)C#C
Show InChI InChI=1S/C26H25N7O3S2/c1-2-18-5-3-6-19(15-18)29-24(34)30-25-31-32-26(38-25)37-23-21-8-7-20(16-22(21)27-17-28-23)36-12-4-9-33-10-13-35-14-11-33/h1,3,5-8,15-17H,4,9-14H2,(H2,29,30,31,34)
NCI pathway
Reactome pathway
n/an/a 6n/an/an/an/an/an/a
Sichuan University
Curated by ChEMBL
Assay Description
Inhibition of human FLT3
J Med Chem 55: 3852-66 (2012)
Article DOI: 10.1021/jm300042x
BindingDB Entry DOI: 10.7270/Q2M61M94