BDBM50386840 CHEMBL2047968
SMILES: COc1cc(ccc1Nc1nc(NC2CCCCC2)c2[nH]cnc2n1)N1CCC(CC1)N1CCOCC1
InChI Key: InChIKey=CYWJZNCONMFGQE-UHFFFAOYSA-N
Data: 1 IC50
Activity Spreadsheet -- Enzyme Inhibition Constant Data from BindingDB
Found 1 hit for monomerid = 50386840
Trg + Lig
Ki
nM
ΔG°
kcal/mole
IC50
nM
Kd
nM
EC50/IC50
nM
koff
s-1
kon
M-1s-1
pHTemp
°C
Dual specificity protein kinase TTK
(Homo sapiens (Human))
BDBM50386840
(CHEMBL2047968)
Show SMILES COc1cc(ccc1Nc1nc(NC2CCCCC2)c2[nH]cnc2n1)N1CCC(CC1)N1CCOCC1
Show InChI InChI=1S/C27H38N8O2/c1-36-23-17-21(34-11-9-20(10-12-34)35-13-15-37-16-14-35)7-8-22(23)31-27-32-25-24(28-18-29-25)26(33-27)30-19-5-3-2-4-6-19/h7-8,17-20H,2-6,9-16H2,1H3,(H3,28,29,30,31,32,33)
n/an/a 11n/an/an/an/an/an/a
Myrexis Inc.
Curated by ChEMBL
Assay Description
Inhibition of Mps1
Bioorg Med Chem Lett 22: 4377-85 (2012)
Article DOI: 10.1016/j.bmcl.2012.04.131
BindingDB Entry DOI: 10.7270/Q2PZ59V9