BDBM50386961 CHEMBL2048825
SMILES: C[C@H](N)C(=O)N(C)[C@@H](C)[C@H](NC(=O)[C@H](C)NC(=O)N[C@@H](Cc1c[nH]c2ccccc12)C(O)=O)C(=O)N\C=C1\C[C@@H](O)[C@@H](O1)n1ccc(=O)[nH]c1=O
InChI Key: InChIKey=PBFVZISIBPPZNE-SYZWNRCCSA-N
Data: 1 IC50
Activity Spreadsheet -- Enzyme Inhibition Constant Data from BindingDB
Found 1 hit for monomerid = 50386961
Trg + Lig
Ki
nM
ΔG°
kcal/mole
IC50
nM
Kd
nM
EC50/IC50
nM
koff
s-1
kon
M-1s-1
pHTemp
°C
Phospho-N-acetylmuramoyl-pentapeptide-transferase
(Staphylococcus aureus (strain MRSA252))
BDBM50386961
(CHEMBL2048825)
Show SMILES C[C@H](N)C(=O)N(C)[C@@H](C)[C@H](NC(=O)[C@H](C)NC(=O)N[C@@H](Cc1c[nH]c2ccccc12)C(O)=O)C(=O)N\C=C1\C[C@@H](O)[C@@H](O1)n1ccc(=O)[nH]c1=O |r|
Show InChI InChI=1S/C32H41N9O10/c1-15(33)28(46)40(4)17(3)25(27(45)35-14-19-12-23(42)29(51-19)41-10-9-24(43)38-32(41)50)39-26(44)16(2)36-31(49)37-22(30(47)48)11-18-13-34-21-8-6-5-7-20(18)21/h5-10,13-17,22-23,25,29,34,42H,11-12,33H2,1-4H3,(H,35,45)(H,39,44)(H,47,48)(H2,36,37,49)(H,38,43,50)/b19-14-/t15-,16-,17-,22-,23+,25-,29+/m0/s1
n/an/a 22n/an/an/an/an/an/a
Shionogi& Co., Ltd
Curated by ChEMBL
Assay Description
Inhibition of Staphylococcus aureus MraY using UDP-MurNAc-dansylpentapeptide substrate assessed as formation of dansylated lipid I incubated for 3 to...
Bioorg Med Chem Lett 22: 4810-5 (2012)
Article DOI: 10.1016/j.bmcl.2012.05.050
BindingDB Entry DOI: 10.7270/Q2J967FP