BDBM50387181 CHEMBL2047999
SMILES: CCNC(=O)Cn1c2ccc(O)cc2s\c1=N\C(N)=N
InChI Key: InChIKey=KYSGCNVIWUVQHJ-FOWTUZBSSA-N
Data: 2 KI  1 Kd
Activity Spreadsheet -- Enzyme Inhibition Constant Data from BindingDB
Found 3 hits for monomerid = 50387181
Trg + Lig
Ki
nM
ΔG°
kcal/mole
IC50
nM
Kd
nM
EC50/IC50
nM
koff
s-1
kon
M-1s-1
pHTemp
°C
Trypsin
(Homo sapiens (Human))
BDBM50387181
(CHEMBL2047999)
Show SMILES CCNC(=O)Cn1c2ccc(O)cc2s\c1=N\C(N)=N
Show InChI InChI=1S/C12H15N5O2S/c1-2-15-10(19)6-17-8-4-3-7(18)5-9(8)20-12(17)16-11(13)14/h3-5,18H,2,6H2,1H3,(H3,13,14)(H,15,19)/b16-12+
Reactome pathway
1.09E+6n/an/an/an/an/an/an/an/a
AstraZeneca
Curated by ChEMBL
Assay Description
Inhibition of human recombinant trypsin 4 using tosyl-GPR-pNA substrate by spectrophotometry
Bioorg Med Chem Lett 22: 4839-43 (2012)
Article DOI: 10.1016/j.bmcl.2012.05.046
BindingDB Entry DOI: 10.7270/Q2QV3NKC
Prothrombin
(Homo sapiens (Human))
BDBM50387181
(CHEMBL2047999)
Show SMILES CCNC(=O)Cn1c2ccc(O)cc2s\c1=N\C(N)=N
Show InChI InChI=1S/C12H15N5O2S/c1-2-15-10(19)6-17-8-4-3-7(18)5-9(8)20-12(17)16-11(13)14/h3-5,18H,2,6H2,1H3,(H3,13,14)(H,15,19)/b16-12+
2.73E+6n/an/an/an/an/an/an/an/a
AstraZeneca
Curated by ChEMBL
Assay Description
Inhibition of human thrombin using tosyl-GPR-pNA substrate by spectrophotometry
Bioorg Med Chem Lett 22: 4839-43 (2012)
Article DOI: 10.1016/j.bmcl.2012.05.046
BindingDB Entry DOI: 10.7270/Q2QV3NKC
Prothrombin
(Homo sapiens (Human))
BDBM50387181
(CHEMBL2047999)
Show SMILES CCNC(=O)Cn1c2ccc(O)cc2s\c1=N\C(N)=N
Show InChI InChI=1S/C12H15N5O2S/c1-2-15-10(19)6-17-8-4-3-7(18)5-9(8)20-12(17)16-11(13)14/h3-5,18H,2,6H2,1H3,(H3,13,14)(H,15,19)/b16-12+
n/an/an/a 1.45E+5n/an/an/an/an/a
AstraZeneca
Curated by ChEMBL
Assay Description
Binding affinity to human alpha thrombin by Biocore A100 assay
Bioorg Med Chem Lett 22: 4839-43 (2012)
Article DOI: 10.1016/j.bmcl.2012.05.046
BindingDB Entry DOI: 10.7270/Q2QV3NKC