BDBM50387264 CHEMBL2048704
SMILES: CC(C)[C@H](C[C@H](O)[C@@H](N)CN1CC(=O)N(CC1(C)C)c1ccccc1Cl)C(=O)NC1CCCCC1
InChI Key: InChIKey=RYWDUVLHECXZTC-SSPYTLHUSA-N
Data: 2 IC50
Activity Spreadsheet -- Enzyme Inhibition Constant Data from BindingDB
Found 2 hits for monomerid = 50387264
Trg + Lig
Ki
nM
ΔG°
kcal/mole
IC50
nM
Kd
nM
EC50/IC50
nM
koff
s-1
kon
M-1s-1
pHTemp
°C
Renin
(Macaca fascicularis)
BDBM50387264
(CHEMBL2048704)
Show SMILES CC(C)[C@H](C[C@H](O)[C@@H](N)CN1CC(=O)N(CC1(C)C)c1ccccc1Cl)C(=O)NC1CCCCC1 |r|
Show InChI InChI=1S/C27H43ClN4O3/c1-18(2)20(26(35)30-19-10-6-5-7-11-19)14-24(33)22(29)15-31-16-25(34)32(17-27(31,3)4)23-13-9-8-12-21(23)28/h8-9,12-13,18-20,22,24,33H,5-7,10-11,14-17,29H2,1-4H3,(H,30,35)/t20-,22-,24-/m0/s1
n/an/a 11n/an/an/an/an/an/a
Daiichi Sankyo Co., Ltd
Curated by ChEMBL
Assay Description
Inhibition of renin in cynomolgus monkey plasma
Bioorg Med Chem Lett 22: 4561-6 (2012)
Article DOI: 10.1016/j.bmcl.2012.05.092
BindingDB Entry DOI: 10.7270/Q2BK1DD9
Renin
(Homo sapiens (Human))
BDBM50387264
(CHEMBL2048704)
Show SMILES CC(C)[C@H](C[C@H](O)[C@@H](N)CN1CC(=O)N(CC1(C)C)c1ccccc1Cl)C(=O)NC1CCCCC1 |r|
Show InChI InChI=1S/C27H43ClN4O3/c1-18(2)20(26(35)30-19-10-6-5-7-11-19)14-24(33)22(29)15-31-16-25(34)32(17-27(31,3)4)23-13-9-8-12-21(23)28/h8-9,12-13,18-20,22,24,33H,5-7,10-11,14-17,29H2,1-4H3,(H,30,35)/t20-,22-,24-/m0/s1
Reactome pathway
n/an/a 1n/an/an/an/an/an/a
Daiichi Sankyo Co., Ltd
Curated by ChEMBL
Assay Description
Inhibition of human purified renin
Bioorg Med Chem Lett 22: 4561-6 (2012)
Article DOI: 10.1016/j.bmcl.2012.05.092
BindingDB Entry DOI: 10.7270/Q2BK1DD9