null
SMILES: N[C@@H]1CCCN(C1)c1c(Br)cccc1C=C1SC(O)=NC1=O
InChI Key: InChIKey=PYWZTKODXYPZLR-SNVBAGLBSA-N
Activity Spreadsheet -- Enzyme Inhibition Constant Data from BindingDB
Found 4 hits for monomerid = 50387310
Trg + Lig
Ki
nM
ΔG°
kcal/mole
IC50
nM
Kd
nM
EC50/IC50
nM
koff
s-1
kon
M-1s-1
pHTemp
°C
Serine/threonine-protein kinase pim-1
(Homo sapiens (Human))
BDBM50387310
(CHEMBL2048867)
Show SMILES N[C@@H]1CCCN(C1)c1c(Br)cccc1C=C1SC(O)=NC1=O |r,w:14.15,c:20|
Show InChI InChI=1S/C15H16BrN3O2S/c16-11-5-1-3-9(7-12-14(20)18-15(21)22-12)13(11)19-6-2-4-10(17)8-19/h1,3,5,7,10H,2,4,6,8,17H2,(H,18,20,21)/t10-/m1/s1
n/an/a 10n/an/an/an/an/an/a
AstraZeneca
Curated by ChEMBL
Assay Description
Inhibition of human PIM1 using FITC-(AHX)RSRHSSYPAGT-COOH as substrate after 90 mins by mobility shift assay in presence of 5 mM ATP
Bioorg Med Chem Lett 22: 4599-604 (2012)
Article DOI: 10.1016/j.bmcl.2012.05.098
BindingDB Entry DOI: 10.7270/Q2348MDS
Potassium voltage-gated channel subfamily H member 2
(Homo sapiens (Human))
BDBM50387310
(CHEMBL2048867)
Show SMILES N[C@@H]1CCCN(C1)c1c(Br)cccc1C=C1SC(O)=NC1=O |r,w:14.15,c:20|
Show InChI InChI=1S/C15H16BrN3O2S/c16-11-5-1-3-9(7-12-14(20)18-15(21)22-12)13(11)19-6-2-4-10(17)8-19/h1,3,5,7,10H,2,4,6,8,17H2,(H,18,20,21)/t10-/m1/s1
Reactome pathway
n/an/a>3.00E+4n/an/an/an/an/an/a
AstraZeneca
Curated by ChEMBL
Assay Description
Inhibition of human ERG
Bioorg Med Chem Lett 22: 4599-604 (2012)
Article DOI: 10.1016/j.bmcl.2012.05.098
BindingDB Entry DOI: 10.7270/Q2348MDS
Serine/threonine-protein kinase pim-3
(Homo sapiens (Human))
BDBM50387310
(CHEMBL2048867)
Show SMILES N[C@@H]1CCCN(C1)c1c(Br)cccc1C=C1SC(O)=NC1=O |r,w:14.15,c:20|
Show InChI InChI=1S/C15H16BrN3O2S/c16-11-5-1-3-9(7-12-14(20)18-15(21)22-12)13(11)19-6-2-4-10(17)8-19/h1,3,5,7,10H,2,4,6,8,17H2,(H,18,20,21)/t10-/m1/s1
n/an/a 10n/an/an/an/an/an/a
AstraZeneca
Curated by ChEMBL
Assay Description
Inhibition of human PIM3 using FITC-(AHX)RSRHSSYPAGT-COOH as substrate after 90 mins by mobility shift assay in presence of 5 mM ATP
Bioorg Med Chem Lett 22: 4599-604 (2012)
Article DOI: 10.1016/j.bmcl.2012.05.098
BindingDB Entry DOI: 10.7270/Q2348MDS
Serine/threonine-protein kinase pim-2
(Homo sapiens (Human))
BDBM50387310
(CHEMBL2048867)
Show SMILES N[C@@H]1CCCN(C1)c1c(Br)cccc1C=C1SC(O)=NC1=O |r,w:14.15,c:20|
Show InChI InChI=1S/C15H16BrN3O2S/c16-11-5-1-3-9(7-12-14(20)18-15(21)22-12)13(11)19-6-2-4-10(17)8-19/h1,3,5,7,10H,2,4,6,8,17H2,(H,18,20,21)/t10-/m1/s1
n/an/a 150n/an/an/an/an/an/a
AstraZeneca
Curated by ChEMBL
Assay Description
Inhibition of human PIM2 using FITC-(AHX)RSRHSSYPAGT-COOH as substrate after 90 mins by mobility shift assay in presence of 5 mM ATP
Bioorg Med Chem Lett 22: 4599-604 (2012)
Article DOI: 10.1016/j.bmcl.2012.05.098
BindingDB Entry DOI: 10.7270/Q2348MDS