null
SMILES: CC1(C)\C(=C\C=C/C2=[N+](CCCc3ccccc3)c3ccc4ccccc4c3C2(C)C)N(CCCc2ccccc2)c2ccc3ccccc3c12
InChI Key: InChIKey=LHZDWBAVGAQVQY-UHFFFAOYSA-N
Activity Spreadsheet -- Enzyme Inhibition Constant Data from BindingDB
Found 1 hit for monomerid = 50387487
Trg + Lig
Ki
nM
ΔG°
kcal/mole
IC50
nM
Kd
nM
EC50/IC50
nM
koff
s-1
kon
M-1s-1
pHTemp
°C
Protein arginine N-methyltransferase 1 [11-371]
(Homo sapiens (Human))
BDBM50387487
(CHEMBL2047487)
Show SMILES CC1(C)\C(=C\C=C/C2=[N+](CCCc3ccccc3)c3ccc4ccccc4c3C2(C)C)N(CCCc2ccccc2)c2ccc3ccccc3c12 |c:7|
Show InChI InChI=1S/C49H49N2/c1-48(2)44(50(34-16-22-36-18-7-5-8-19-36)42-32-30-38-24-11-13-26-40(38)46(42)48)28-15-29-45-49(3,4)47-41-27-14-12-25-39(41)31-33-43(47)51(45)35-17-23-37-20-9-6-10-21-37/h5-15,18-21,24-33H,16-17,22-23,34-35H2,1-4H3/q+1
n/an/a 1.43E+4n/an/an/an/an/an/a
Georgia State University
Curated by ChEMBL
Assay Description
Inhibition of His-tagged PRMT1 expressed in Escherichia coli BL21(DE3) cells using [14C]-S-adenosyl-L-methionine and histone H4 peptide after 8 mins ...
Eur J Med Chem 54: 647-59 (2012)
Article DOI: 10.1016/j.ejmech.2012.06.017
BindingDB Entry DOI: 10.7270/Q2XD12R6