BDBM50387555 CHEMBL2057442
SMILES: COc1cc2CCN3Cc4c(OC)cc(OC)c(CO)c4C[C@H]3c2cc1OC
InChI Key: InChIKey=FDMHBTAXJFCYLV-SFHVURJKSA-N
Data: 2 KI  1 IC50
Activity Spreadsheet -- Enzyme Inhibition Constant Data from BindingDB
Found 3 hits for monomerid = 50387555
Trg + Lig
Ki
nM
ΔG°
kcal/mole
IC50
nM
Kd
nM
EC50/IC50
nM
koff
s-1
kon
M-1s-1
pHTemp
°C
D(1A) dopamine receptor
(Homo sapiens (Human))
BDBM50387555
(CHEMBL2057442)
Show SMILES COc1cc2CCN3Cc4c(OC)cc(OC)c(CO)c4C[C@H]3c2cc1OC |r|
Show InChI InChI=1S/C22H27NO5/c1-25-19-10-20(26-2)17(12-24)15-8-18-14-9-22(28-4)21(27-3)7-13(14)5-6-23(18)11-16(15)19/h7,9-10,18,24H,5-6,8,11-12H2,1-4H3/t18-/m0/s1
64.1n/an/an/an/an/an/an/an/a
Shenyang Pharmaceutical University
Curated by ChEMBL
Assay Description
Displacement of [3H]SCH23390 from human dopamine D1 receptor expressed in HEK293 cells
Bioorg Med Chem 20: 4862-71 (2012)
Article DOI: 10.1016/j.bmc.2012.05.057
BindingDB Entry DOI: 10.7270/Q28P61K9
5-hydroxytryptamine receptor 1A
(Homo sapiens (Human))
BDBM50387555
(CHEMBL2057442)
Show SMILES COc1cc2CCN3Cc4c(OC)cc(OC)c(CO)c4C[C@H]3c2cc1OC |r|
Show InChI InChI=1S/C22H27NO5/c1-25-19-10-20(26-2)17(12-24)15-8-18-14-9-22(28-4)21(27-3)7-13(14)5-6-23(18)11-16(15)19/h7,9-10,18,24H,5-6,8,11-12H2,1-4H3/t18-/m0/s1
730n/an/an/an/an/an/an/an/a
Shenyang Pharmaceutical University
Curated by ChEMBL
Assay Description
Displacement of [3H]-8-OH-DPAT from human 5HT1A receptor expressed in HEK293 cells
Bioorg Med Chem 20: 4862-71 (2012)
Article DOI: 10.1016/j.bmc.2012.05.057
BindingDB Entry DOI: 10.7270/Q28P61K9
D(1A) dopamine receptor
(Homo sapiens (Human))
BDBM50387555
(CHEMBL2057442)
Show SMILES COc1cc2CCN3Cc4c(OC)cc(OC)c(CO)c4C[C@H]3c2cc1OC |r|
Show InChI InChI=1S/C22H27NO5/c1-25-19-10-20(26-2)17(12-24)15-8-18-14-9-22(28-4)21(27-3)7-13(14)5-6-23(18)11-16(15)19/h7,9-10,18,24H,5-6,8,11-12H2,1-4H3/t18-/m0/s1
n/an/a 114n/an/an/an/an/an/a
Shenyang Pharmaceutical University
Curated by ChEMBL
Assay Description
Displacement of [3H]SCH23390 from human dopamine D1 receptor expressed in HEK293 cells
Bioorg Med Chem 20: 4862-71 (2012)
Article DOI: 10.1016/j.bmc.2012.05.057
BindingDB Entry DOI: 10.7270/Q28P61K9