BDBM50387587 CHEMBL2057730::US8633204, 211
SMILES: Cc1nc(N)nc2n(C3CC3)c(=O)c(cc12)-c1cn[nH]c1
InChI Key: InChIKey=VJJRLZSQNXGZAK-UHFFFAOYSA-N
Data: 2 KI  1 IC50
Activity Spreadsheet -- Enzyme Inhibition Constant Data from BindingDB
Found 3 hits for monomerid = 50387587
Trg + Lig
Ki
nM
ΔG°
kcal/mole
IC50
nM
Kd
nM
EC50/IC50
nM
koff
s-1
kon
M-1s-1
pHTemp
°C
Phosphatidylinositol 4,5-bisphosphate 3-kinase catalytic subunit alpha isoform (PI3K alpha)
(Mus musculus (Mouse))
BDBM50387587
(CHEMBL2057730 | US8633204, 211)
Show SMILES Cc1nc(N)nc2n(C3CC3)c(=O)c(cc12)-c1cn[nH]c1
Show InChI InChI=1S/C14H14N6O/c1-7-10-4-11(8-5-16-17-6-8)13(21)20(9-2-3-9)12(10)19-14(15)18-7/h4-6,9H,2-3H2,1H3,(H,16,17)(H2,15,18,19)
36n/an/an/an/an/an/an/an/a
Pfizer Inc.
Curated by ChEMBL
Assay Description
Inhibition of mouse PI3Kalpha
Bioorg Med Chem Lett 22: 5098-103 (2012)
Article DOI: 10.1016/j.bmcl.2012.05.100
BindingDB Entry DOI: 10.7270/Q2CF9R58
Serine/threonine-protein kinase mTOR
(Homo sapiens (Human))
BDBM50387587
(CHEMBL2057730 | US8633204, 211)
Show SMILES Cc1nc(N)nc2n(C3CC3)c(=O)c(cc12)-c1cn[nH]c1
Show InChI InChI=1S/C14H14N6O/c1-7-10-4-11(8-5-16-17-6-8)13(21)20(9-2-3-9)12(10)19-14(15)18-7/h4-6,9H,2-3H2,1H3,(H,16,17)(H2,15,18,19)
NCI pathway
Reactome pathway
190n/an/an/an/an/an/an/an/a
Pfizer Inc.
Curated by ChEMBL
Assay Description
Inhibition of human mTOR
Bioorg Med Chem Lett 22: 5098-103 (2012)
Article DOI: 10.1016/j.bmcl.2012.05.100
BindingDB Entry DOI: 10.7270/Q2CF9R58
Phosphatidylinositol 4,5-bisphosphate 3-kinase catalytic subunit alpha isoform
(Homo sapiens (Human))
BDBM50387587
(CHEMBL2057730 | US8633204, 211)
Show SMILES Cc1nc(N)nc2n(C3CC3)c(=O)c(cc12)-c1cn[nH]c1
Show InChI InChI=1S/C14H14N6O/c1-7-10-4-11(8-5-16-17-6-8)13(21)20(9-2-3-9)12(10)19-14(15)18-7/h4-6,9H,2-3H2,1H3,(H,16,17)(H2,15,18,19)
NCI pathway
Reactome pathway
US Patent
n/an/a 78n/an/an/an/a7.425
Pfizer Inc.
US Patent
Assay Description
Compounds of the present invention were evaluated for potency against PI3-Kα using an in vitro kinase assay. PI3-Kα activity is measured in...
US Patent US8633204 (2014)
BindingDB Entry DOI: 10.7270/Q2Q81BQT