BDBM50387922 CHEMBL2058685::US9283222, 476
SMILES: COCCC(=O)Nc1cc(Cc2n[nH]c(=O)c3CCCNc23)ccc1F
InChI Key: InChIKey=HCXMNLCCKOKFQJ-UHFFFAOYSA-N
Data: 2 KI  1 EC50
Activity Spreadsheet -- Enzyme Inhibition Constant Data from BindingDB
Found 3 hits for monomerid = 50387922
Trg + Lig
Ki
nM
ΔG°
kcal/mole
IC50
nM
Kd
nM
EC50/IC50
nM
koff
s-1
kon
M-1s-1
pHTemp
°C
Poly [ADP-ribose] polymerase 1
(Homo sapiens (Human))
BDBM50387922
(CHEMBL2058685 | US9283222, 476)
Show SMILES COCCC(=O)Nc1cc(Cc2n[nH]c(=O)c3CCCNc23)ccc1F
Show InChI InChI=1S/C18H21FN4O3/c1-26-8-6-16(24)21-14-9-11(4-5-13(14)19)10-15-17-12(3-2-7-20-17)18(25)23-22-15/h4-5,9,20H,2-3,6-8,10H2,1H3,(H,21,24)(H,23,25)
US Patent
12n/an/an/an/an/an/a8.0n/a
AbbVie Inc.
US Patent
Assay Description
PARP1 assay was conducted in PARP assay buffer containing 50 mM Tris pH 8.0, 1 mM DTT, 4 mM MgCl2. PARP reactions contained 1.5 uM [3H]-NAD+ (1.6 uCi...
US Patent US9283222 (2016)
BindingDB Entry DOI: 10.7270/Q2BZ64XD
Poly [ADP-ribose] polymerase 1
(Homo sapiens (Human))
BDBM50387922
(CHEMBL2058685 | US9283222, 476)
Show SMILES COCCC(=O)Nc1cc(Cc2n[nH]c(=O)c3CCCNc23)ccc1F
Show InChI InChI=1S/C18H21FN4O3/c1-26-8-6-16(24)21-14-9-11(4-5-13(14)19)10-15-17-12(3-2-7-20-17)18(25)23-22-15/h4-5,9,20H,2-3,6-8,10H2,1H3,(H,21,24)(H,23,25)
12n/an/an/an/an/an/an/an/a
Abbott Laboratories
Curated by ChEMBL
Assay Description
Inhibition of PARP1 using [3H]NAD+ after 1 hr by scintillation counting
Bioorg Med Chem 20: 4635-45 (2012)
Article DOI: 10.1016/j.bmc.2012.06.021
BindingDB Entry DOI: 10.7270/Q2PN96P7
Poly [ADP-ribose] polymerase 1
(Homo sapiens (Human))
BDBM50387922
(CHEMBL2058685 | US9283222, 476)
Show SMILES COCCC(=O)Nc1cc(Cc2n[nH]c(=O)c3CCCNc23)ccc1F
Show InChI InChI=1S/C18H21FN4O3/c1-26-8-6-16(24)21-14-9-11(4-5-13(14)19)10-15-17-12(3-2-7-20-17)18(25)23-22-15/h4-5,9,20H,2-3,6-8,10H2,1H3,(H,21,24)(H,23,25)
n/an/an/an/a 134n/an/an/an/a
Abbott Laboratories
Curated by ChEMBL
Assay Description
Inhibition of PARP1 in H202-stimulated human C41 cells incubated for 30 mins prior to H2O2-treatment measured after 10 mins by FITC-based immunostain...
Bioorg Med Chem 20: 4635-45 (2012)
Article DOI: 10.1016/j.bmc.2012.06.021
BindingDB Entry DOI: 10.7270/Q2PN96P7