BDBM50388015 CHEMBL1170237
SMILES: CN1C(=N)N(C)\C(=C\c2c[nH]c3ccc(Br)cc23)C1=O
InChI Key: InChIKey=DICVBGGIAAPPNV-ZSUDRMHPSA-N
Data: 1 KI  2 IC50
Activity Spreadsheet -- Enzyme Inhibition Constant Data from BindingDB
Found 3 hits for monomerid = 50388015
Trg + Lig
Ki
nM
ΔG°
kcal/mole
IC50
nM
Kd
nM
EC50/IC50
nM
koff
s-1
kon
M-1s-1
pHTemp
°C
5-hydroxytryptamine receptor 3A
(Homo sapiens (Human))
BDBM50388015
(CHEMBL1170237)
Show SMILES CN1C(=N)N(C)\C(=C\c2c[nH]c3ccc(Br)cc23)C1=O
Show InChI InChI=1S/C14H13BrN4O/c1-18-12(13(20)19(2)14(18)16)5-8-7-17-11-4-3-9(15)6-10(8)11/h3-7,16-17H,1-2H3/b12-5+,16-14?
Reactome pathway
1.00E+3n/an/an/an/an/an/an/an/a
University of Mississippi
Curated by ChEMBL
Assay Description
Displacement of [3H]GR65630 from human recombinant 5HT3 receptor expressed in HEKT cells
Bioorg Med Chem 21: 7083-90 (2013)
Article DOI: 10.1016/j.bmc.2013.09.011
BindingDB Entry DOI: 10.7270/Q2RJ4KXM
Amine oxidase (flavin-containing) A
(Homo sapiens (Human))
BDBM50388015
(CHEMBL1170237)
Show SMILES CN1C(=N)N(C)\C(=C\c2c[nH]c3ccc(Br)cc23)C1=O
Show InChI InChI=1S/C14H13BrN4O/c1-18-12(13(20)19(2)14(18)16)5-8-7-17-11-4-3-9(15)6-10(8)11/h3-7,16-17H,1-2H3/b12-5+,16-14?
n/an/a 236n/an/an/an/an/an/a
University of Mississippi
Curated by ChEMBL
Assay Description
Inhibition of human recombinant MAO-A using kynuramine as substrate preincubated with compound for 15 mins measured after 20 mins by fluorometric ana...
Bioorg Med Chem Lett 22: 4926-9 (2012)
Article DOI: 10.1016/j.bmcl.2012.06.058
BindingDB Entry DOI: 10.7270/Q21Z45GF
Amine oxidase [flavin-containing] B
(Homo sapiens (Human))
BDBM50388015
(CHEMBL1170237)
Show SMILES CN1C(=N)N(C)\C(=C\c2c[nH]c3ccc(Br)cc23)C1=O
Show InChI InChI=1S/C14H13BrN4O/c1-18-12(13(20)19(2)14(18)16)5-8-7-17-11-4-3-9(15)6-10(8)11/h3-7,16-17H,1-2H3/b12-5+,16-14?
n/an/a 2.70E+3n/an/an/an/an/an/a
University of Mississippi
Curated by ChEMBL
Assay Description
Inhibition of human recombinant MAO-B using kynuramine as substrate preincubated with compound for 15 mins measured after 20 mins by fluorometric ana...
Bioorg Med Chem Lett 22: 4926-9 (2012)
Article DOI: 10.1016/j.bmcl.2012.06.058
BindingDB Entry DOI: 10.7270/Q21Z45GF