null
SMILES: CC[C@@H]1CCCC[C@@]1(O)C(=O)C(=O)N1CCCC[C@H]1C(=O)O[C@H](CCc1ccc(OC)c(OC)c1)c1cccc(OCC(O)=O)c1
InChI Key: InChIKey=JLRDMSUQFUWACS-XACWCOMZSA-N
PDB links: 2 PDB IDs match this monomer.
Activity Spreadsheet -- Enzyme Inhibition Constant Data from BindingDB
Found 6 hits for monomerid = 50388319
Trg + Lig
Ki
nM
ΔG°
kcal/mole
IC50
nM
Kd
nM
EC50/IC50
nM
koff
s-1
kon
M-1s-1
pHTemp
°C
Peptidyl-prolyl cis-trans isomerase FKBP1A
(Homo sapiens (Human))
BDBM50388319
(CHEMBL2059033)
Show SMILES CC[C@@H]1CCCC[C@@]1(O)C(=O)C(=O)N1CCCC[C@H]1C(=O)O[C@H](CCc1ccc(OC)c(OC)c1)c1cccc(OCC(O)=O)c1 |r|
Show InChI InChI=1S/C35H45NO10/c1-4-25-11-5-7-18-35(25,42)32(39)33(40)36-19-8-6-13-27(36)34(41)46-28(24-10-9-12-26(21-24)45-22-31(37)38)16-14-23-15-17-29(43-2)30(20-23)44-3/h9-10,12,15,17,20-21,25,27-28,42H,4-8,11,13-14,16,18-19,22H2,1-3H3,(H,37,38)/t25-,27+,28-,35+/m1/s1
NCI pathway
Reactome pathway
n/an/a 320n/an/an/an/an/an/a
Max Planck Institute of Psychiatry
Curated by ChEMBL
Assay Description
Binding affinity to FKBP12 by fluorescence polarization assay
J Med Chem 55: 4114-22 (2012)
Article DOI: 10.1021/jm201746x
BindingDB Entry DOI: 10.7270/Q2KS6SMP
Peptidyl-prolyl cis-trans isomerase FKBP1A
(Homo sapiens (Human))
BDBM50388319
(CHEMBL2059033)
Show SMILES CC[C@@H]1CCCC[C@@]1(O)C(=O)C(=O)N1CCCC[C@H]1C(=O)O[C@H](CCc1ccc(OC)c(OC)c1)c1cccc(OCC(O)=O)c1 |r|
Show InChI InChI=1S/C35H45NO10/c1-4-25-11-5-7-18-35(25,42)32(39)33(40)36-19-8-6-13-27(36)34(41)46-28(24-10-9-12-26(21-24)45-22-31(37)38)16-14-23-15-17-29(43-2)30(20-23)44-3/h9-10,12,15,17,20-21,25,27-28,42H,4-8,11,13-14,16,18-19,22H2,1-3H3,(H,37,38)/t25-,27+,28-,35+/m1/s1
NCI pathway
Reactome pathway
n/an/a 320n/an/an/an/an/an/a
Max Planck Institute of Psychiatry
Curated by ChEMBL
Assay Description
Binding affinity to FKBP12 by fluorescence polarization assay
J Med Chem 55: 4114-22 (2012)
Article DOI: 10.1021/jm201746x
BindingDB Entry DOI: 10.7270/Q2KS6SMP
Peptidyl-prolyl cis-trans isomerase FKBP4
(Homo sapiens (Human))
BDBM50388319
(CHEMBL2059033)
Show SMILES CC[C@@H]1CCCC[C@@]1(O)C(=O)C(=O)N1CCCC[C@H]1C(=O)O[C@H](CCc1ccc(OC)c(OC)c1)c1cccc(OCC(O)=O)c1 |r|
Show InChI InChI=1S/C35H45NO10/c1-4-25-11-5-7-18-35(25,42)32(39)33(40)36-19-8-6-13-27(36)34(41)46-28(24-10-9-12-26(21-24)45-22-31(37)38)16-14-23-15-17-29(43-2)30(20-23)44-3/h9-10,12,15,17,20-21,25,27-28,42H,4-8,11,13-14,16,18-19,22H2,1-3H3,(H,37,38)/t25-,27+,28-,35+/m1/s1
NCI pathway
Reactome pathway
n/an/a 9.50E+3n/an/an/an/an/an/a
Max Planck Institute of Psychiatry
Curated by ChEMBL
Assay Description
Binding affinity to FKBP52 FK1 domain by fluorescence polarization assay
J Med Chem 55: 4114-22 (2012)
Article DOI: 10.1021/jm201746x
BindingDB Entry DOI: 10.7270/Q2KS6SMP
Peptidyl-prolyl cis-trans isomerase FKBP5
(Homo sapiens (Human))
BDBM50388319
(CHEMBL2059033)
Show SMILES CC[C@@H]1CCCC[C@@]1(O)C(=O)C(=O)N1CCCC[C@H]1C(=O)O[C@H](CCc1ccc(OC)c(OC)c1)c1cccc(OCC(O)=O)c1 |r|
Show InChI InChI=1S/C35H45NO10/c1-4-25-11-5-7-18-35(25,42)32(39)33(40)36-19-8-6-13-27(36)34(41)46-28(24-10-9-12-26(21-24)45-22-31(37)38)16-14-23-15-17-29(43-2)30(20-23)44-3/h9-10,12,15,17,20-21,25,27-28,42H,4-8,11,13-14,16,18-19,22H2,1-3H3,(H,37,38)/t25-,27+,28-,35+/m1/s1
n/an/a 3.90E+3n/an/an/an/an/an/a
Max Planck Institute of Psychiatry
Curated by ChEMBL
Assay Description
Binding affinity to FKBP51 FK1 domain by fluorescence polarization assay
J Med Chem 55: 4114-22 (2012)
Article DOI: 10.1021/jm201746x
BindingDB Entry DOI: 10.7270/Q2KS6SMP
3D
3D Structure (crystal)
Peptidyl-prolyl cis-trans isomerase FKBP4
(Homo sapiens (Human))
BDBM50388319
(CHEMBL2059033)
Show SMILES CC[C@@H]1CCCC[C@@]1(O)C(=O)C(=O)N1CCCC[C@H]1C(=O)O[C@H](CCc1ccc(OC)c(OC)c1)c1cccc(OCC(O)=O)c1 |r|
Show InChI InChI=1S/C35H45NO10/c1-4-25-11-5-7-18-35(25,42)32(39)33(40)36-19-8-6-13-27(36)34(41)46-28(24-10-9-12-26(21-24)45-22-31(37)38)16-14-23-15-17-29(43-2)30(20-23)44-3/h9-10,12,15,17,20-21,25,27-28,42H,4-8,11,13-14,16,18-19,22H2,1-3H3,(H,37,38)/t25-,27+,28-,35+/m1/s1
NCI pathway
Reactome pathway
n/an/a 9.50E+3n/an/an/an/an/an/a
Max Planck Institute of Psychiatry
Curated by ChEMBL
Assay Description
Binding affinity to FKBP52 FK1 domain by fluorescence polarization assay
J Med Chem 55: 4114-22 (2012)
Article DOI: 10.1021/jm201746x
BindingDB Entry DOI: 10.7270/Q2KS6SMP
Peptidyl-prolyl cis-trans isomerase FKBP5
(Homo sapiens (Human))
BDBM50388319
(CHEMBL2059033)
Show SMILES CC[C@@H]1CCCC[C@@]1(O)C(=O)C(=O)N1CCCC[C@H]1C(=O)O[C@H](CCc1ccc(OC)c(OC)c1)c1cccc(OCC(O)=O)c1 |r|
Show InChI InChI=1S/C35H45NO10/c1-4-25-11-5-7-18-35(25,42)32(39)33(40)36-19-8-6-13-27(36)34(41)46-28(24-10-9-12-26(21-24)45-22-31(37)38)16-14-23-15-17-29(43-2)30(20-23)44-3/h9-10,12,15,17,20-21,25,27-28,42H,4-8,11,13-14,16,18-19,22H2,1-3H3,(H,37,38)/t25-,27+,28-,35+/m1/s1
n/an/a 3.90E+3n/an/an/an/an/an/a
Max Planck Institute of Psychiatry
Curated by ChEMBL
Assay Description
Binding affinity to FKBP51 FK1 domain by fluorescence polarization assay
J Med Chem 55: 4114-22 (2012)
Article DOI: 10.1021/jm201746x
BindingDB Entry DOI: 10.7270/Q2KS6SMP
3D
3D Structure (crystal)