null
SMILES: CC(C)CCC[C@@H](C)[C@H]1CC[C@H]2[C@@H]3CC[C@H]4C[C@H](CC[C@]4(C)[C@H]3CC[C@]12C)O[C@H]1O[C@H](COS([O-])(=O)=O)[C@@H](OS([O-])(=O)=O)[C@H](OS([O-])(=O)=O)[C@@H]1O[C@H]1O[C@H](COS([O-])(=O)=O)[C@@H](OS([O-])(=O)=O)[C@H](O[C@H]2O[C@H](COS([O-])(=O)=O)[C@@H](OS([O-])(=O)=O)[C@H](OS([O-])(=O)=O)[C@@H]2OS([O-])(=O)=O)[C@@H]1OS([O-])(=O)=O
InChI Key: InChIKey=IPWXMKVZKOEZQH-AQHRIOQOSA-D
Activity Spreadsheet -- Enzyme Inhibition Constant Data from BindingDB
Found 3 hits for monomerid = 50388345
Trg + Lig
Ki
nM
ΔG°
kcal/mole
IC50
nM
Kd
nM
EC50/IC50
nM
koff
s-1
kon
M-1s-1
pHTemp
°C
Heparanase
(Homo sapiens (Human))
BDBM50388345
(CHEMBL2059245)
Show SMILES CC(C)CCC[C@@H](C)[C@H]1CC[C@H]2[C@@H]3CC[C@H]4C[C@H](CC[C@]4(C)[C@H]3CC[C@]12C)O[C@H]1O[C@H](COS([O-])(=O)=O)[C@@H](OS([O-])(=O)=O)[C@H](OS([O-])(=O)=O)[C@@H]1O[C@H]1O[C@H](COS([O-])(=O)=O)[C@@H](OS([O-])(=O)=O)[C@H](O[C@H]2O[C@H](COS([O-])(=O)=O)[C@@H](OS([O-])(=O)=O)[C@H](OS([O-])(=O)=O)[C@@H]2OS([O-])(=O)=O)[C@@H]1OS([O-])(=O)=O |r|
Show InChI InChI=1S/C45H78O46S10/c1-21(2)7-6-8-22(3)26-11-12-27-25-10-9-23-17-24(13-15-44(23,4)28(25)14-16-45(26,27)5)79-41-38(36(88-98(64,65)66)33(86-96(58,59)60)30(80-41)19-77-93(49,50)51)84-42-39(90-100(70,71)72)35(32(85-95(55,56)57)29(81-42)18-76-92(46,47)48)83-43-40(91-101(73,74)75)37(89-99(67,68)69)34(87-97(61,62)63)31(82-43)20-78-94(52,53)54/h21-43H,6-20H2,1-5H3,(H,46,47,48)(H,49,50,51)(H,52,53,54)(H,55,56,57)(H,58,59,60)(H,61,62,63)(H,64,65,66)(H,67,68,69)(H,70,71,72)(H,73,74,75)/p-10/t22-,23+,24+,25+,26-,27+,28+,29-,30-,31-,32-,33-,34-,35+,36+,37+,38+,39+,40+,41+,42-,43-,44+,45-/m1/s1
6.40n/an/an/an/an/an/an/an/a
Progen Pharmaceuticals Limited
Curated by ChEMBL
Assay Description
Inhibition of human recombinant heparanase after 2 to 24 hrs by WST1 dye based fondaparinux assay
J Med Chem 55: 3804-13 (2012)
Article DOI: 10.1021/jm201708h
BindingDB Entry DOI: 10.7270/Q2G161WN
Fibroblast growth factor 1
(Homo sapiens (Human))
BDBM50388345
(CHEMBL2059245)
Show SMILES CC(C)CCC[C@@H](C)[C@H]1CC[C@H]2[C@@H]3CC[C@H]4C[C@H](CC[C@]4(C)[C@H]3CC[C@]12C)O[C@H]1O[C@H](COS([O-])(=O)=O)[C@@H](OS([O-])(=O)=O)[C@H](OS([O-])(=O)=O)[C@@H]1O[C@H]1O[C@H](COS([O-])(=O)=O)[C@@H](OS([O-])(=O)=O)[C@H](O[C@H]2O[C@H](COS([O-])(=O)=O)[C@@H](OS([O-])(=O)=O)[C@H](OS([O-])(=O)=O)[C@@H]2OS([O-])(=O)=O)[C@@H]1OS([O-])(=O)=O |r|
Show InChI InChI=1S/C45H78O46S10/c1-21(2)7-6-8-22(3)26-11-12-27-25-10-9-23-17-24(13-15-44(23,4)28(25)14-16-45(26,27)5)79-41-38(36(88-98(64,65)66)33(86-96(58,59)60)30(80-41)19-77-93(49,50)51)84-42-39(90-100(70,71)72)35(32(85-95(55,56)57)29(81-42)18-76-92(46,47)48)83-43-40(91-101(73,74)75)37(89-99(67,68)69)34(87-97(61,62)63)31(82-43)20-78-94(52,53)54/h21-43H,6-20H2,1-5H3,(H,46,47,48)(H,49,50,51)(H,52,53,54)(H,55,56,57)(H,58,59,60)(H,61,62,63)(H,64,65,66)(H,67,68,69)(H,70,71,72)(H,73,74,75)/p-10/t22-,23+,24+,25+,26-,27+,28+,29-,30-,31-,32-,33-,34-,35+,36+,37+,38+,39+,40+,41+,42-,43-,44+,45-/m1/s1
Reactome pathway
n/an/an/a 18.5n/an/an/an/an/a
Progen Pharmaceuticals Limited
Curated by ChEMBL
Assay Description
Binding affinity to FGF-1 by surface plasmon resonance assay
J Med Chem 55: 3804-13 (2012)
Article DOI: 10.1021/jm201708h
BindingDB Entry DOI: 10.7270/Q2G161WN
Fibroblast growth factor 2
(Homo sapiens (Human))
BDBM50388345
(CHEMBL2059245)
Show SMILES CC(C)CCC[C@@H](C)[C@H]1CC[C@H]2[C@@H]3CC[C@H]4C[C@H](CC[C@]4(C)[C@H]3CC[C@]12C)O[C@H]1O[C@H](COS([O-])(=O)=O)[C@@H](OS([O-])(=O)=O)[C@H](OS([O-])(=O)=O)[C@@H]1O[C@H]1O[C@H](COS([O-])(=O)=O)[C@@H](OS([O-])(=O)=O)[C@H](O[C@H]2O[C@H](COS([O-])(=O)=O)[C@@H](OS([O-])(=O)=O)[C@H](OS([O-])(=O)=O)[C@@H]2OS([O-])(=O)=O)[C@@H]1OS([O-])(=O)=O |r|
Show InChI InChI=1S/C45H78O46S10/c1-21(2)7-6-8-22(3)26-11-12-27-25-10-9-23-17-24(13-15-44(23,4)28(25)14-16-45(26,27)5)79-41-38(36(88-98(64,65)66)33(86-96(58,59)60)30(80-41)19-77-93(49,50)51)84-42-39(90-100(70,71)72)35(32(85-95(55,56)57)29(81-42)18-76-92(46,47)48)83-43-40(91-101(73,74)75)37(89-99(67,68)69)34(87-97(61,62)63)31(82-43)20-78-94(52,53)54/h21-43H,6-20H2,1-5H3,(H,46,47,48)(H,49,50,51)(H,52,53,54)(H,55,56,57)(H,58,59,60)(H,61,62,63)(H,64,65,66)(H,67,68,69)(H,70,71,72)(H,73,74,75)/p-10/t22-,23+,24+,25+,26-,27+,28+,29-,30-,31-,32-,33-,34-,35+,36+,37+,38+,39+,40+,41+,42-,43-,44+,45-/m1/s1
Reactome pathway
n/an/an/a 631n/an/an/an/an/a
Progen Pharmaceuticals Limited
Curated by ChEMBL
Assay Description
Binding affinity to FGF-2 by surface plasmon resonance assay
J Med Chem 55: 3804-13 (2012)
Article DOI: 10.1021/jm201708h
BindingDB Entry DOI: 10.7270/Q2G161WN