null
SMILES: CC(NCCNC(C)=O)c1cnc2c(C)c(NC(=O)c3ccc(OCC4CC4)cc3)ccc2c1
InChI Key: InChIKey=HRYQXLHGNOJEHH-UHFFFAOYSA-N
Activity Spreadsheet -- Enzyme Inhibition Constant Data from BindingDB
Found 2 hits for monomerid = 50388458
Trg + Lig
Ki
nM
ΔG°
kcal/mole
IC50
nM
Kd
nM
EC50/IC50
nM
koff
s-1
kon
M-1s-1
pHTemp
°C
Melanin-concentrating hormone receptor 1
(Homo sapiens (Human))
BDBM50388458
(CHEMBL2059511)
Show SMILES CC(NCCNC(C)=O)c1cnc2c(C)c(NC(=O)c3ccc(OCC4CC4)cc3)ccc2c1
Show InChI InChI=1S/C27H32N4O3/c1-17-25(31-27(33)21-6-9-24(10-7-21)34-16-20-4-5-20)11-8-22-14-23(15-30-26(17)22)18(2)28-12-13-29-19(3)32/h6-11,14-15,18,20,28H,4-5,12-13,16H2,1-3H3,(H,29,32)(H,31,33)
Reactome pathway
n/an/a 1.90n/an/an/an/an/an/a
Takeda Pharmaceutical Co., Ltd.
Curated by ChEMBL
Assay Description
Displacement of [125I]MCH from human MCHR1 expressed in CHO cells after 60 mins by liquid scintillation counting
J Med Chem 55: 4336-51 (2012)
Article DOI: 10.1021/jm300167z
BindingDB Entry DOI: 10.7270/Q2JS9RHR
Melanin-concentrating hormone receptor 1
(RAT)
BDBM50388458
(CHEMBL2059511)
Show SMILES CC(NCCNC(C)=O)c1cnc2c(C)c(NC(=O)c3ccc(OCC4CC4)cc3)ccc2c1
Show InChI InChI=1S/C27H32N4O3/c1-17-25(31-27(33)21-6-9-24(10-7-21)34-16-20-4-5-20)11-8-22-14-23(15-30-26(17)22)18(2)28-12-13-29-19(3)32/h6-11,14-15,18,20,28H,4-5,12-13,16H2,1-3H3,(H,29,32)(H,31,33)
Reactome pathway
n/an/a 3.40n/an/an/an/an/an/a
Takeda Pharmaceutical Co., Ltd.
Curated by ChEMBL
Assay Description
Displacement of [125I]MCH from rat MCHR1 expressed in CHO cells after 60 mins by liquid scintillation counting
J Med Chem 55: 4336-51 (2012)
Article DOI: 10.1021/jm300167z
BindingDB Entry DOI: 10.7270/Q2JS9RHR