null
SMILES: C[C@]12CC[C@H]3[C@@H](CC[C@H]4C[C@@H](O)CC[C@]34C)[C@@H]1CC[C@@H]2C(=O)CCl
InChI Key: InChIKey=JXGFGNDGQLRGPL-VTBMCCKRSA-N
Activity Spreadsheet -- Enzyme Inhibition Constant Data from BindingDB
Found 1 hit for monomerid = 50388479
Trg + Lig
Ki
nM
ΔG°
kcal/mole
IC50
nM
Kd
nM
EC50/IC50
nM
koff
s-1
kon
M-1s-1
pHTemp
°C
Glucose-6-phosphate 1-dehydrogenase
(Homo sapiens (Human))
BDBM50388479
(CHEMBL2057973)
Show SMILES C[C@]12CC[C@H]3[C@@H](CC[C@H]4C[C@@H](O)CC[C@]34C)[C@@H]1CC[C@@H]2C(=O)CCl |r|
Show InChI InChI=1S/C21H33ClO2/c1-20-9-7-14(23)11-13(20)3-4-15-16-5-6-18(19(24)12-22)21(16,2)10-8-17(15)20/h13-18,23H,3-12H2,1-2H3/t13-,14-,15-,16-,17-,18+,20-,21-/m0/s1
n/an/a 9.30E+3n/an/an/an/an/an/a
University of Manchester
Curated by ChEMBL
Assay Description
Inhibition of human recombinant N-terminal His tagged G6PD expressed in Escherichia coli JM109 (DE3) cells assessed as production of NADPH after 30 m...
J Med Chem 55: 4431-45 (2012)
Article DOI: 10.1021/jm300317k
BindingDB Entry DOI: 10.7270/Q298883V