null
SMILES: C[C@]12CC[C@H]3[C@@H](CC[C@H]4C[C@@H](O)CC[C@]34C)[C@@H]1CC[C@]2(O)C(=O)CO
InChI Key: InChIKey=UPTAPIKFKZGAGM-NWIHUDFTSA-N
Activity Spreadsheet -- Enzyme Inhibition Constant Data from BindingDB
Found 1 hit for monomerid = 50388486
Trg + Lig
Ki
nM
ΔG°
kcal/mole
IC50
nM
Kd
nM
EC50/IC50
nM
koff
s-1
kon
M-1s-1
pHTemp
°C
Glucose-6-phosphate 1-dehydrogenase
(Homo sapiens (Human))
BDBM50388486
(CHEMBL2057979)
Show SMILES C[C@]12CC[C@H]3[C@@H](CC[C@H]4C[C@@H](O)CC[C@]34C)[C@@H]1CC[C@]2(O)C(=O)CO |r|
Show InChI InChI=1S/C21H34O4/c1-19-8-5-14(23)11-13(19)3-4-15-16(19)6-9-20(2)17(15)7-10-21(20,25)18(24)12-22/h13-17,22-23,25H,3-12H2,1-2H3/t13-,14-,15+,16-,17-,19-,20-,21-/m0/s1
n/an/a 5.20E+3n/an/an/an/an/an/a
University of Manchester
Curated by ChEMBL
Assay Description
Inhibition of human recombinant N-terminal His tagged G6PD expressed in Escherichia coli JM109 (DE3) cells assessed as production of NADPH after 30 m...
J Med Chem 55: 4431-45 (2012)
Article DOI: 10.1021/jm300317k
BindingDB Entry DOI: 10.7270/Q298883V