null
SMILES: C[C@]12CC[C@H]3[C@@H](CC[C@H]4C[C@H](CC[C@]34C)NS(N)(=O)=O)[C@@H]1CCC2=O
InChI Key: InChIKey=QLIJDTTVUNSTPX-LUJOEAJASA-N
Activity Spreadsheet -- Enzyme Inhibition Constant Data from BindingDB
Found 2 hits for monomerid = 50388490
Trg + Lig
Ki
nM
ΔG°
kcal/mole
IC50
nM
Kd
nM
EC50/IC50
nM
koff
s-1
kon
M-1s-1
pHTemp
°C
Glucose-6-phosphate 1-dehydrogenase
(Homo sapiens (Human))
BDBM50388490
(CHEMBL2057300)
Show SMILES C[C@]12CC[C@H]3[C@@H](CC[C@H]4C[C@H](CC[C@]34C)NS(N)(=O)=O)[C@@H]1CCC2=O |r|
Show InChI InChI=1S/C19H32N2O3S/c1-18-9-7-13(21-25(20,23)24)11-12(18)3-4-14-15-5-6-17(22)19(15,2)10-8-16(14)18/h12-16,21H,3-11H2,1-2H3,(H2,20,23,24)/t12-,13-,14-,15-,16-,18-,19-/m0/s1
n/an/a 1.20E+3n/an/an/an/an/an/a
University of Manchester
Curated by ChEMBL
Assay Description
Inhibition of human recombinant N-terminal His tagged G6PD expressed in Escherichia coli JM109 (DE3) cells assessed as production of NADPH after 30 m...
J Med Chem 55: 4431-45 (2012)
Article DOI: 10.1021/jm300317k
BindingDB Entry DOI: 10.7270/Q298883V
Glucose-6-phosphate 1-dehydrogenase
(Homo sapiens (Human))
BDBM50388490
(CHEMBL2057300)
Show SMILES C[C@]12CC[C@H]3[C@@H](CC[C@H]4C[C@H](CC[C@]34C)NS(N)(=O)=O)[C@@H]1CCC2=O |r|
Show InChI InChI=1S/C19H32N2O3S/c1-18-9-7-13(21-25(20,23)24)11-12(18)3-4-14-15-5-6-17(22)19(15,2)10-8-16(14)18/h12-16,21H,3-11H2,1-2H3,(H2,20,23,24)/t12-,13-,14-,15-,16-,18-,19-/m0/s1
n/an/a 1.74E+4n/an/an/an/an/an/a
University of Manchester
Curated by ChEMBL
Assay Description
Inhibition of G6PD in HEK293T cells assessed as accumulation of 6-phosphogluconate after 5 hrs by LC-MS/MS analysis using 6-aminonicotinamide
J Med Chem 55: 4431-45 (2012)
Article DOI: 10.1021/jm300317k
BindingDB Entry DOI: 10.7270/Q298883V