BDBM50388536 CHEMBL2058831
SMILES: CC(C)[C@H]1N(CCn2c(Nc3ccc(F)c(Cl)c3)c(nc12)-c1ccc(F)cc1)C(=O)CN
InChI Key: InChIKey=SOMKGSRZWDCYHI-OAQYLSRUSA-N
Data: 1 IC50
Activity Spreadsheet -- Enzyme Inhibition Constant Data from BindingDB
Found 1 hit for monomerid = 50388536
Trg + Lig
Ki
nM
ΔG°
kcal/mole
IC50
nM
Kd
nM
EC50/IC50
nM
koff
s-1
kon
M-1s-1
pHTemp
°C
Potassium voltage-gated channel subfamily H member 2
(Homo sapiens (Human))
BDBM50388536
(CHEMBL2058831)
Show SMILES CC(C)[C@H]1N(CCn2c(Nc3ccc(F)c(Cl)c3)c(nc12)-c1ccc(F)cc1)C(=O)CN |r|
Show InChI InChI=1S/C23H24ClF2N5O/c1-13(2)21-23-29-20(14-3-5-15(25)6-4-14)22(28-16-7-8-18(26)17(24)11-16)31(23)10-9-30(21)19(32)12-27/h3-8,11,13,21,28H,9-10,12,27H2,1-2H3/t21-/m1/s1
Reactome pathway
n/an/a 1.34E+4n/an/an/an/an/an/a
Genomics Institute of the Novartis Research Foundation
Curated by ChEMBL
Assay Description
Inhibition of human ERG channel expressed in CHO cells by patch clamp assay
J Med Chem 55: 4244-73 (2012)
Article DOI: 10.1021/jm300041e
BindingDB Entry DOI: 10.7270/Q21V5G1P