BDBM50388704 CHEMBL2059871
SMILES: Cc1ccc(cc1NC(=O)c1ccc(OCc2ccccn2)cc1)-c1cc([nH]n1)C(F)(F)F
InChI Key: InChIKey=GTYGXABMOCTPEJ-UHFFFAOYSA-N
Data: 2 IC50  1 EC50
Activity Spreadsheet -- Enzyme Inhibition Constant Data from BindingDB
Found 3 hits for monomerid = 50388704
Trg + Lig
Ki
nM
ΔG°
kcal/mole
IC50
nM
Kd
nM
EC50/IC50
nM
koff
s-1
kon
M-1s-1
pHTemp
°C
Mitogen-activated protein kinase 14
(Homo sapiens (Human))
BDBM50388704
(CHEMBL2059871)
Show SMILES Cc1ccc(cc1NC(=O)c1ccc(OCc2ccccn2)cc1)-c1cc([nH]n1)C(F)(F)F
Show InChI InChI=1S/C24H19F3N4O2/c1-15-5-6-17(21-13-22(31-30-21)24(25,26)27)12-20(15)29-23(32)16-7-9-19(10-8-16)33-14-18-4-2-3-11-28-18/h2-13H,14H2,1H3,(H,29,32)(H,30,31)
NCI pathway
Reactome pathway
n/an/a 1.00E+5n/an/an/an/an/an/a
AstraZeneca
Curated by ChEMBL
Assay Description
Inhibition of p38alpha
Bioorg Med Chem Lett 22: 4907-11 (2012)
Article DOI: 10.1016/j.bmcl.2012.04.104
BindingDB Entry DOI: 10.7270/Q2W37XCG
G-protein- coupled-like receptor Smoothened (Smo)
(Homo sapiens (Human))
BDBM50388704
(CHEMBL2059871)
Show SMILES Cc1ccc(cc1NC(=O)c1ccc(OCc2ccccn2)cc1)-c1cc([nH]n1)C(F)(F)F
Show InChI InChI=1S/C24H19F3N4O2/c1-15-5-6-17(21-13-22(31-30-21)24(25,26)27)12-20(15)29-23(32)16-7-9-19(10-8-16)33-14-18-4-2-3-11-28-18/h2-13H,14H2,1H3,(H,29,32)(H,30,31)
n/an/an/an/a 29n/an/an/an/a
AstraZeneca
Curated by ChEMBL
Assay Description
Inhibition of Smo expressed in mouse C3H10T1/2 cells assessed as reduction in alkaline phosphatase level after 72 hrs by spectrophotometric analysis
Bioorg Med Chem Lett 22: 4907-11 (2012)
Article DOI: 10.1016/j.bmcl.2012.04.104
BindingDB Entry DOI: 10.7270/Q2W37XCG
G-protein- coupled-like receptor Smoothened (Smo)
(Homo sapiens (Human))
BDBM50388704
(CHEMBL2059871)
Show SMILES Cc1ccc(cc1NC(=O)c1ccc(OCc2ccccn2)cc1)-c1cc([nH]n1)C(F)(F)F
Show InChI InChI=1S/C24H19F3N4O2/c1-15-5-6-17(21-13-22(31-30-21)24(25,26)27)12-20(15)29-23(32)16-7-9-19(10-8-16)33-14-18-4-2-3-11-28-18/h2-13H,14H2,1H3,(H,29,32)(H,30,31)
n/an/a 9n/an/an/an/an/an/a
AstraZeneca
Curated by ChEMBL
Assay Description
Inhibition of Smo expressed in mouse NIH/3T3 cells after 20 hrs by Gli reporter gene assay
Bioorg Med Chem Lett 22: 4907-11 (2012)
Article DOI: 10.1016/j.bmcl.2012.04.104
BindingDB Entry DOI: 10.7270/Q2W37XCG