BDBM50388705 CHEMBL2059859
SMILES: Cc1ccc(cc1NC(=O)c1ccc(OCc2ccccn2)cc1)-c1nc2ccccc2[nH]1
InChI Key: InChIKey=XXXYUGWOUJSRGE-UHFFFAOYSA-N
Data: 2 IC50  1 EC50
Activity Spreadsheet -- Enzyme Inhibition Constant Data from BindingDB
Found 3 hits for monomerid = 50388705
Trg + Lig
Ki
nM
ΔG°
kcal/mole
IC50
nM
Kd
nM
EC50/IC50
nM
koff
s-1
kon
M-1s-1
pHTemp
°C
G-protein- coupled-like receptor Smoothened (Smo)
(Homo sapiens (Human))
BDBM50388705
(CHEMBL2059859)
Show SMILES Cc1ccc(cc1NC(=O)c1ccc(OCc2ccccn2)cc1)-c1nc2ccccc2[nH]1
Show InChI InChI=1S/C27H22N4O2/c1-18-9-10-20(26-29-23-7-2-3-8-24(23)30-26)16-25(18)31-27(32)19-11-13-22(14-12-19)33-17-21-6-4-5-15-28-21/h2-16H,17H2,1H3,(H,29,30)(H,31,32)
n/an/a 5n/an/an/an/an/an/a
AstraZeneca
Curated by ChEMBL
Assay Description
Inhibition of Smo expressed in mouse NIH/3T3 cells after 20 hrs by Gli reporter gene assay
Bioorg Med Chem Lett 22: 4907-11 (2012)
Article DOI: 10.1016/j.bmcl.2012.04.104
BindingDB Entry DOI: 10.7270/Q2W37XCG
Mitogen-activated protein kinase 14
(Homo sapiens (Human))
BDBM50388705
(CHEMBL2059859)
Show SMILES Cc1ccc(cc1NC(=O)c1ccc(OCc2ccccn2)cc1)-c1nc2ccccc2[nH]1
Show InChI InChI=1S/C27H22N4O2/c1-18-9-10-20(26-29-23-7-2-3-8-24(23)30-26)16-25(18)31-27(32)19-11-13-22(14-12-19)33-17-21-6-4-5-15-28-21/h2-16H,17H2,1H3,(H,29,30)(H,31,32)
NCI pathway
Reactome pathway
n/an/a 3.00E+4n/an/an/an/an/an/a
AstraZeneca
Curated by ChEMBL
Assay Description
Inhibition of p38alpha
Bioorg Med Chem Lett 22: 4907-11 (2012)
Article DOI: 10.1016/j.bmcl.2012.04.104
BindingDB Entry DOI: 10.7270/Q2W37XCG
G-protein- coupled-like receptor Smoothened (Smo)
(Homo sapiens (Human))
BDBM50388705
(CHEMBL2059859)
Show SMILES Cc1ccc(cc1NC(=O)c1ccc(OCc2ccccn2)cc1)-c1nc2ccccc2[nH]1
Show InChI InChI=1S/C27H22N4O2/c1-18-9-10-20(26-29-23-7-2-3-8-24(23)30-26)16-25(18)31-27(32)19-11-13-22(14-12-19)33-17-21-6-4-5-15-28-21/h2-16H,17H2,1H3,(H,29,30)(H,31,32)
n/an/an/an/a 30n/an/an/an/a
AstraZeneca
Curated by ChEMBL
Assay Description
Inhibition of Smo expressed in mouse C3H10T1/2 cells assessed as reduction in alkaline phosphatase level after 72 hrs by spectrophotometric analysis
Bioorg Med Chem Lett 22: 4907-11 (2012)
Article DOI: 10.1016/j.bmcl.2012.04.104
BindingDB Entry DOI: 10.7270/Q2W37XCG