BDBM50388707 CHEMBL2059864
SMILES: Cc1c[nH]c(n1)-c1ccc(C)c(NC(=O)c2ccc(OCc3ccccn3)cc2)c1
InChI Key: InChIKey=GMVNSGUKXHWVSS-UHFFFAOYSA-N
Data: 2 IC50  1 EC50
Activity Spreadsheet -- Enzyme Inhibition Constant Data from BindingDB
Found 3 hits for monomerid = 50388707
Trg + Lig
Ki
nM
ΔG°
kcal/mole
IC50
nM
Kd
nM
EC50/IC50
nM
koff
s-1
kon
M-1s-1
pHTemp
°C
G-protein- coupled-like receptor Smoothened (Smo)
(Homo sapiens (Human))
BDBM50388707
(CHEMBL2059864)
Show SMILES Cc1c[nH]c(n1)-c1ccc(C)c(NC(=O)c2ccc(OCc3ccccn3)cc2)c1
Show InChI InChI=1S/C24H22N4O2/c1-16-6-7-19(23-26-14-17(2)27-23)13-22(16)28-24(29)18-8-10-21(11-9-18)30-15-20-5-3-4-12-25-20/h3-14H,15H2,1-2H3,(H,26,27)(H,28,29)
n/an/a 2.60n/an/an/an/an/an/a
AstraZeneca
Curated by ChEMBL
Assay Description
Inhibition of Smo expressed in mouse NIH/3T3 cells after 20 hrs by Gli reporter gene assay
Bioorg Med Chem Lett 22: 4907-11 (2012)
Article DOI: 10.1016/j.bmcl.2012.04.104
BindingDB Entry DOI: 10.7270/Q2W37XCG
Mitogen-activated protein kinase 14
(Homo sapiens (Human))
BDBM50388707
(CHEMBL2059864)
Show SMILES Cc1c[nH]c(n1)-c1ccc(C)c(NC(=O)c2ccc(OCc3ccccn3)cc2)c1
Show InChI InChI=1S/C24H22N4O2/c1-16-6-7-19(23-26-14-17(2)27-23)13-22(16)28-24(29)18-8-10-21(11-9-18)30-15-20-5-3-4-12-25-20/h3-14H,15H2,1-2H3,(H,26,27)(H,28,29)
NCI pathway
Reactome pathway
n/an/a 5.90E+3n/an/an/an/an/an/a
AstraZeneca
Curated by ChEMBL
Assay Description
Inhibition of p38alpha
Bioorg Med Chem Lett 22: 4907-11 (2012)
Article DOI: 10.1016/j.bmcl.2012.04.104
BindingDB Entry DOI: 10.7270/Q2W37XCG
G-protein- coupled-like receptor Smoothened (Smo)
(Homo sapiens (Human))
BDBM50388707
(CHEMBL2059864)
Show SMILES Cc1c[nH]c(n1)-c1ccc(C)c(NC(=O)c2ccc(OCc3ccccn3)cc2)c1
Show InChI InChI=1S/C24H22N4O2/c1-16-6-7-19(23-26-14-17(2)27-23)13-22(16)28-24(29)18-8-10-21(11-9-18)30-15-20-5-3-4-12-25-20/h3-14H,15H2,1-2H3,(H,26,27)(H,28,29)
n/an/an/an/a 15n/an/an/an/a
AstraZeneca
Curated by ChEMBL
Assay Description
Inhibition of Smo expressed in mouse C3H10T1/2 cells assessed as reduction in alkaline phosphatase level after 72 hrs by spectrophotometric analysis
Bioorg Med Chem Lett 22: 4907-11 (2012)
Article DOI: 10.1016/j.bmcl.2012.04.104
BindingDB Entry DOI: 10.7270/Q2W37XCG