BDBM50388821 CHEMBL2062591
SMILES: CCCCCCCCCCCCCCCC(NCc1cccc(C)c1)=C1C(=O)OC(CO)C1=O
InChI Key: InChIKey=OEECGLYZTWBFHW-UHFFFAOYSA-N
Data: 7 IC50
Activity Spreadsheet -- Enzyme Inhibition Constant Data from BindingDB
Found 7 hits for monomerid = 50388821
Trg + Lig
Ki
nM
ΔG°
kcal/mole
IC50
nM
Kd
nM
EC50/IC50
nM
koff
s-1
kon
M-1s-1
pHTemp
°C
Dual specificity protein phosphatase 6
(Homo sapiens (Human))
BDBM50388821
(CHEMBL2062591)
Show SMILES CCCCCCCCCCCCCCCC(NCc1cccc(C)c1)=C1C(=O)OC(CO)C1=O |w:15.15|
Show InChI InChI=1S/C29H45NO4/c1-3-4-5-6-7-8-9-10-11-12-13-14-15-19-25(27-28(32)26(22-31)34-29(27)33)30-21-24-18-16-17-23(2)20-24/h16-18,20,26,30-31H,3-15,19,21-22H2,1-2H3
Reactome pathway
n/an/a>1.00E+5n/an/an/an/an/an/a
TBA
Curated by ChEMBL
Assay Description
Inhibition of MKP3
ACS Med Chem Lett 3: 294-298 (2012)
Article DOI: 10.1021/ml2002778
BindingDB Entry DOI: 10.7270/Q2ZW1N0H
Protein-tyrosine phosphatase 1B
(Homo sapiens (Human))
BDBM50388821
(CHEMBL2062591)
Show SMILES CCCCCCCCCCCCCCCC(NCc1cccc(C)c1)=C1C(=O)OC(CO)C1=O |w:15.15|
Show InChI InChI=1S/C29H45NO4/c1-3-4-5-6-7-8-9-10-11-12-13-14-15-19-25(27-28(32)26(22-31)34-29(27)33)30-21-24-18-16-17-23(2)20-24/h16-18,20,26,30-31H,3-15,19,21-22H2,1-2H3
NCI pathway
Reactome pathway
n/an/a>1.00E+5n/an/an/an/an/an/a
TBA
Curated by ChEMBL
Assay Description
Inhibition of PTP1B
ACS Med Chem Lett 3: 294-298 (2012)
Article DOI: 10.1021/ml2002778
BindingDB Entry DOI: 10.7270/Q2ZW1N0H
phosphatase Cdc25
(Homo sapiens (Human))
BDBM50388821
(CHEMBL2062591)
Show SMILES CCCCCCCCCCCCCCCC(NCc1cccc(C)c1)=C1C(=O)OC(CO)C1=O |w:15.15|
Show InChI InChI=1S/C29H45NO4/c1-3-4-5-6-7-8-9-10-11-12-13-14-15-19-25(27-28(32)26(22-31)34-29(27)33)30-21-24-18-16-17-23(2)20-24/h16-18,20,26,30-31H,3-15,19,21-22H2,1-2H3
Reactome pathway
n/an/a>1.00E+5n/an/an/an/an/an/a
TBA
Curated by ChEMBL
Assay Description
Inhibition of CDC25A
ACS Med Chem Lett 3: 294-298 (2012)
Article DOI: 10.1021/ml2002778
BindingDB Entry DOI: 10.7270/Q2ZW1N0H
Dual Specificity Protein Phosphatase 1
(Homo sapiens (Human))
BDBM50388821
(CHEMBL2062591)
Show SMILES CCCCCCCCCCCCCCCC(NCc1cccc(C)c1)=C1C(=O)OC(CO)C1=O |w:15.15|
Show InChI InChI=1S/C29H45NO4/c1-3-4-5-6-7-8-9-10-11-12-13-14-15-19-25(27-28(32)26(22-31)34-29(27)33)30-21-24-18-16-17-23(2)20-24/h16-18,20,26,30-31H,3-15,19,21-22H2,1-2H3
NCI pathway
n/an/a>1.00E+5n/an/an/an/an/an/a
TBA
Curated by ChEMBL
Assay Description
Inhibition of MKP1
ACS Med Chem Lett 3: 294-298 (2012)
Article DOI: 10.1021/ml2002778
BindingDB Entry DOI: 10.7270/Q2ZW1N0H
Cdc25C
(Homo sapiens (Human))
BDBM50388821
(CHEMBL2062591)
Show SMILES CCCCCCCCCCCCCCCC(NCc1cccc(C)c1)=C1C(=O)OC(CO)C1=O |w:15.15|
Show InChI InChI=1S/C29H45NO4/c1-3-4-5-6-7-8-9-10-11-12-13-14-15-19-25(27-28(32)26(22-31)34-29(27)33)30-21-24-18-16-17-23(2)20-24/h16-18,20,26,30-31H,3-15,19,21-22H2,1-2H3
n/an/a>1.00E+5n/an/an/an/an/an/a
TBA
Curated by ChEMBL
Assay Description
Inhibition of CDC25C
ACS Med Chem Lett 3: 294-298 (2012)
Article DOI: 10.1021/ml2002778
BindingDB Entry DOI: 10.7270/Q2ZW1N0H
Dual specificity protein phosphatase (VHR)
(Homo sapiens (Human))
BDBM50388821
(CHEMBL2062591)
Show SMILES CCCCCCCCCCCCCCCC(NCc1cccc(C)c1)=C1C(=O)OC(CO)C1=O |w:15.15|
Show InChI InChI=1S/C29H45NO4/c1-3-4-5-6-7-8-9-10-11-12-13-14-15-19-25(27-28(32)26(22-31)34-29(27)33)30-21-24-18-16-17-23(2)20-24/h16-18,20,26,30-31H,3-15,19,21-22H2,1-2H3
Reactome pathway
n/an/a 1.63E+3n/an/an/an/an/an/a
TBA
Curated by ChEMBL
Assay Description
Inhibition of VHR
ACS Med Chem Lett 3: 294-298 (2012)
Article DOI: 10.1021/ml2002778
BindingDB Entry DOI: 10.7270/Q2ZW1N0H
Dual specificity phosphatase Cdc25B
(Homo sapiens (Human))
BDBM50388821
(CHEMBL2062591)
Show SMILES CCCCCCCCCCCCCCCC(NCc1cccc(C)c1)=C1C(=O)OC(CO)C1=O |w:15.15|
Show InChI InChI=1S/C29H45NO4/c1-3-4-5-6-7-8-9-10-11-12-13-14-15-19-25(27-28(32)26(22-31)34-29(27)33)30-21-24-18-16-17-23(2)20-24/h16-18,20,26,30-31H,3-15,19,21-22H2,1-2H3
Reactome pathway
n/an/a>1.00E+5n/an/an/an/an/an/a
TBA
Curated by ChEMBL
Assay Description
Inhibition of CDC25B
ACS Med Chem Lett 3: 294-298 (2012)
Article DOI: 10.1021/ml2002778
BindingDB Entry DOI: 10.7270/Q2ZW1N0H