BDBM50389270 CHEMBL2063450
SMILES: Nc1noc2cccc(C(=O)Nc3cccc(CNS(=O)(=O)c4ccccc4)c3)c12
InChI Key: InChIKey=OMJMLYDFJTVVNK-UHFFFAOYSA-N
Data: 2 IC50
Activity Spreadsheet -- Enzyme Inhibition Constant Data from BindingDB
Found 2 hits for monomerid = 50389270
Trg + Lig
Ki
nM
ΔG°
kcal/mole
IC50
nM
Kd
nM
EC50/IC50
nM
koff
s-1
kon
M-1s-1
pHTemp
°C
Aurora kinase A
(Homo sapiens (Human))
BDBM50389270
(CHEMBL2063450)
Show SMILES Nc1noc2cccc(C(=O)Nc3cccc(CNS(=O)(=O)c4ccccc4)c3)c12
Show InChI InChI=1S/C21H18N4O4S/c22-20-19-17(10-5-11-18(19)29-25-20)21(26)24-15-7-4-6-14(12-15)13-23-30(27,28)16-8-2-1-3-9-16/h1-12,23H,13H2,(H2,22,25)(H,24,26)
NCI pathway
Reactome pathway
n/an/a>1.25E+4n/an/an/an/an/an/a
Abbott Laboratories
Curated by ChEMBL
Assay Description
Inhibition of Aurora A kinase by HTRF analysis in presence of 1 mM ATP
Bioorg Med Chem Lett 22: 4528-31 (2012)
Article DOI: 10.1016/j.bmcl.2012.05.125
BindingDB Entry DOI: 10.7270/Q2T154RT
Aurora kinase B
(Homo sapiens (Human))
BDBM50389270
(CHEMBL2063450)
Show SMILES Nc1noc2cccc(C(=O)Nc3cccc(CNS(=O)(=O)c4ccccc4)c3)c12
Show InChI InChI=1S/C21H18N4O4S/c22-20-19-17(10-5-11-18(19)29-25-20)21(26)24-15-7-4-6-14(12-15)13-23-30(27,28)16-8-2-1-3-9-16/h1-12,23H,13H2,(H2,22,25)(H,24,26)
Reactome pathway
n/an/a>1.25E+4n/an/an/an/an/an/a
Abbott Laboratories
Curated by ChEMBL
Assay Description
Inhibition of Aurora B kinase by HTRF analysis in presence of 1 mM ATP
Bioorg Med Chem Lett 22: 4528-31 (2012)
Article DOI: 10.1016/j.bmcl.2012.05.125
BindingDB Entry DOI: 10.7270/Q2T154RT