BDBM50389470 CHEMBL2063030
SMILES: N[C@@H](CCC(O)=O)C(=O)N1C[C@H](O)C[C@H]1B(O)O
InChI Key: InChIKey=ZXZUNWVRSSPWJV-VQVTYTSYSA-N
Data: 3 IC50
Activity Spreadsheet -- Enzyme Inhibition Constant Data from BindingDB
Found 3 hits for monomerid = 50389470
Trg + Lig
Ki
nM
ΔG°
kcal/mole
IC50
nM
Kd
nM
EC50/IC50
nM
koff
s-1
kon
M-1s-1
pHTemp
°C
Dipeptidyl peptidase 4
(Homo sapiens (Human))
BDBM50389470
(CHEMBL2063030)
Show SMILES N[C@@H](CCC(O)=O)C(=O)N1C[C@H](O)C[C@H]1B(O)O |r|
Show InChI InChI=1S/C9H17BN2O6/c11-6(1-2-8(14)15)9(16)12-4-5(13)3-7(12)10(17)18/h5-7,13,17-18H,1-4,11H2,(H,14,15)/t5-,6+,7+/m1/s1
Reactome pathway
n/an/a 17n/an/an/an/an/an/a
Tufts University School of Medicine
Curated by ChEMBL
Assay Description
Inhibition of human DPP4 expressed in HEK293 cells using Ala-Pro-p-nitroanilide hydrochloride salt as substrate preincubated for 10 mins prior to add...
Bioorg Med Chem Lett 22: 5536-40 (2012)
Article DOI: 10.1016/j.bmcl.2012.07.033
BindingDB Entry DOI: 10.7270/Q2M909QF
Dipeptidyl peptidase 9
(Homo sapiens (Human))
BDBM50389470
(CHEMBL2063030)
Show SMILES N[C@@H](CCC(O)=O)C(=O)N1C[C@H](O)C[C@H]1B(O)O |r|
Show InChI InChI=1S/C9H17BN2O6/c11-6(1-2-8(14)15)9(16)12-4-5(13)3-7(12)10(17)18/h5-7,13,17-18H,1-4,11H2,(H,14,15)/t5-,6+,7+/m1/s1
n/an/a 86n/an/an/an/an/an/a
Tufts University School of Medicine
Curated by ChEMBL
Assay Description
Inhibition of human DPP9 expressed in HEK293 cells using Ala-Pro-p-nitroanilide hydrochloride salt as substrate preincubated for 10 mins prior to add...
Bioorg Med Chem Lett 22: 5536-40 (2012)
Article DOI: 10.1016/j.bmcl.2012.07.033
BindingDB Entry DOI: 10.7270/Q2M909QF
Dipeptidyl peptidase VIII
(Homo sapiens (Human))
BDBM50389470
(CHEMBL2063030)
Show SMILES N[C@@H](CCC(O)=O)C(=O)N1C[C@H](O)C[C@H]1B(O)O |r|
Show InChI InChI=1S/C9H17BN2O6/c11-6(1-2-8(14)15)9(16)12-4-5(13)3-7(12)10(17)18/h5-7,13,17-18H,1-4,11H2,(H,14,15)/t5-,6+,7+/m1/s1
n/an/a 320n/an/an/an/an/an/a
Tufts University School of Medicine
Curated by ChEMBL
Assay Description
Inhibition of human DPP8 expressed in HEK293 cells using Ala-Pro-p-nitroanilide hydrochloride salt as substrate preincubated for 10 mins prior to add...
Bioorg Med Chem Lett 22: 5536-40 (2012)
Article DOI: 10.1016/j.bmcl.2012.07.033
BindingDB Entry DOI: 10.7270/Q2M909QF