BDBM50390097 CHEMBL2069410
SMILES: COc1ncc(cc1F)-c1cccc2OC[C@H](Cc12)NC(=O)c1ccc(OCC(F)(F)F)nc1
InChI Key: InChIKey=ZTCPMSPMGABOTJ-HNNXBMFYSA-N
Data: 3 IC50
Activity Spreadsheet -- Enzyme Inhibition Constant Data from BindingDB
Found 3 hits for monomerid = 50390097
Trg + Lig
Ki
nM
ΔG°
kcal/mole
IC50
nM
Kd
nM
EC50/IC50
nM
koff
s-1
kon
M-1s-1
pHTemp
°C
Sodium channel protein type 5 subunit alpha
(Homo sapiens (Human))
BDBM50390097
(CHEMBL2069410)
Show SMILES COc1ncc(cc1F)-c1cccc2OC[C@H](Cc12)NC(=O)c1ccc(OCC(F)(F)F)nc1 |r|
Show InChI InChI=1S/C23H19F4N3O4/c1-32-22-18(24)7-14(10-29-22)16-3-2-4-19-17(16)8-15(11-33-19)30-21(31)13-5-6-20(28-9-13)34-12-23(25,26)27/h2-7,9-10,15H,8,11-12H2,1H3,(H,30,31)/t15-/m0/s1
n/an/a 3.98E+3n/an/an/an/an/an/a
AstraZeneca
Curated by ChEMBL
Assay Description
Inhibition of human NaV1.5 expressed in CHO cells by IonWorks assay
Bioorg Med Chem Lett 22: 5618-24 (2012)
Article DOI: 10.1016/j.bmcl.2012.06.105
BindingDB Entry DOI: 10.7270/Q2ZC83ZX
Potassium voltage-gated channel subfamily H member 2
(Homo sapiens (Human))
BDBM50390097
(CHEMBL2069410)
Show SMILES COc1ncc(cc1F)-c1cccc2OC[C@H](Cc12)NC(=O)c1ccc(OCC(F)(F)F)nc1 |r|
Show InChI InChI=1S/C23H19F4N3O4/c1-32-22-18(24)7-14(10-29-22)16-3-2-4-19-17(16)8-15(11-33-19)30-21(31)13-5-6-20(28-9-13)34-12-23(25,26)27/h2-7,9-10,15H,8,11-12H2,1H3,(H,30,31)/t15-/m0/s1
Reactome pathway
n/an/a 2.51E+4n/an/an/an/an/an/a
AstraZeneca
Curated by ChEMBL
Assay Description
Inhibition of human ERG expressed in CHO cells by IonWorks HT assay
Bioorg Med Chem Lett 22: 5618-24 (2012)
Article DOI: 10.1016/j.bmcl.2012.06.105
BindingDB Entry DOI: 10.7270/Q2ZC83ZX
Sodium channel protein type 9 subunit alpha
(Homo sapiens (Human))
BDBM50390097
(CHEMBL2069410)
Show SMILES COc1ncc(cc1F)-c1cccc2OC[C@H](Cc12)NC(=O)c1ccc(OCC(F)(F)F)nc1 |r|
Show InChI InChI=1S/C23H19F4N3O4/c1-32-22-18(24)7-14(10-29-22)16-3-2-4-19-17(16)8-15(11-33-19)30-21(31)13-5-6-20(28-9-13)34-12-23(25,26)27/h2-7,9-10,15H,8,11-12H2,1H3,(H,30,31)/t15-/m0/s1
n/an/a 398n/an/an/an/an/an/a
AstraZeneca
Curated by ChEMBL
Assay Description
Inhibition of human NaV1.7 expressed in HEK293 cells by whole-cell voltage clamp assay
Bioorg Med Chem Lett 22: 5618-24 (2012)
Article DOI: 10.1016/j.bmcl.2012.06.105
BindingDB Entry DOI: 10.7270/Q2ZC83ZX