BDBM50390817 CHEMBL2070654
SMILES: COc1cc(cc2c1nnc1c(C)nc(-c3ccccc3C)n21)N1CCOCC1
InChI Key: InChIKey=WTHIWWQIRPIFLQ-UHFFFAOYSA-N
Data: 1 IC50
Activity Spreadsheet -- Enzyme Inhibition Constant Data from BindingDB
Found 1 hit for monomerid = 50390817
Trg + Lig
Ki
nM
ΔG°
kcal/mole
IC50
nM
Kd
nM
EC50/IC50
nM
koff
s-1
kon
M-1s-1
pHTemp
°C
cAMP and cAMP-inhibited cGMP 3',5'-cyclic phosphodiesterase 10A
(Homo sapiens (Human))
BDBM50390817
(CHEMBL2070654)
Show SMILES COc1cc(cc2c1nnc1c(C)nc(-c3ccccc3C)n21)N1CCOCC1
Show InChI InChI=1S/C22H23N5O2/c1-14-6-4-5-7-17(14)22-23-15(2)21-25-24-20-18(27(21)22)12-16(13-19(20)28-3)26-8-10-29-11-9-26/h4-7,12-13H,8-11H2,1-3H3
Reactome pathway
n/an/a 1.53n/an/an/an/an/an/a
Pfizer Inc.
Curated by ChEMBL
Assay Description
Inhibition of human recombinant PDE10A-catalyzed cAMP hydrolysis
Bioorg Med Chem Lett 22: 5876-84 (2012)
Article DOI: 10.1016/j.bmcl.2012.07.076
BindingDB Entry DOI: 10.7270/Q2FB5413