BDBM50390870 CHEMBL2070962
SMILES: COc1ccc(cc1)-c1csc(NC(=O)[C@H]2CCCCN2S(=O)(=O)c2ccc3OCOc3c2)n1
InChI Key: InChIKey=DBBOQJMMLCGLIJ-LJQANCHMSA-N
Data: 1 EC50
Activity Spreadsheet -- Enzyme Inhibition Constant Data from BindingDB
Found 1 hit for monomerid = 50390870
Trg + Lig
Ki
nM
ΔG°
kcal/mole
IC50
nM
Kd
nM
EC50/IC50
nM
koff
s-1
kon
M-1s-1
pHTemp
°C
KCNQ (Kv7) potassium channel
(Homo sapiens (Human))
BDBM50390870
(CHEMBL2070962)
Show SMILES COc1ccc(cc1)-c1csc(NC(=O)[C@H]2CCCCN2S(=O)(=O)c2ccc3OCOc3c2)n1 |r|
Show InChI InChI=1S/C23H23N3O6S2/c1-30-16-7-5-15(6-8-16)18-13-33-23(24-18)25-22(27)19-4-2-3-11-26(19)34(28,29)17-9-10-20-21(12-17)32-14-31-20/h5-10,12-13,19H,2-4,11,14H2,1H3,(H,24,25,27)/t19-/m1/s1
Reactome pathway
n/an/an/an/a 780n/an/an/an/a
Vanderbilt University Medical Center
Curated by ChEMBL
Assay Description
Activation of Kv7.1 channel expressed in CHO cells assessed as depolarization-induced thallium influx after 3 mins by patch clamp assay
Bioorg Med Chem Lett 22: 5936-41 (2012)
Article DOI: 10.1016/j.bmcl.2012.07.060
BindingDB Entry DOI: 10.7270/Q25T3MKN