BDBM50390871 CHEMBL2070963
SMILES: COc1ccc(cc1)-c1csc(NC(=O)[C@H]2CCCCN2S(=O)(=O)c2ccccc2C#N)n1
InChI Key: InChIKey=YSTDPMOQUXAVIL-HXUWFJFHSA-N
Data: 1 EC50
Activity Spreadsheet -- Enzyme Inhibition Constant Data from BindingDB
Found 1 hit for monomerid = 50390871
Trg + Lig
Ki
nM
ΔG°
kcal/mole
IC50
nM
Kd
nM
EC50/IC50
nM
koff
s-1
kon
M-1s-1
pHTemp
°C
KCNQ (Kv7) potassium channel
(Homo sapiens (Human))
BDBM50390871
(CHEMBL2070963)
Show SMILES COc1ccc(cc1)-c1csc(NC(=O)[C@H]2CCCCN2S(=O)(=O)c2ccccc2C#N)n1 |r|
Show InChI InChI=1S/C23H22N4O4S2/c1-31-18-11-9-16(10-12-18)19-15-32-23(25-19)26-22(28)20-7-4-5-13-27(20)33(29,30)21-8-3-2-6-17(21)14-24/h2-3,6,8-12,15,20H,4-5,7,13H2,1H3,(H,25,26,28)/t20-/m1/s1
Reactome pathway
n/an/an/an/a>3.00E+4n/an/an/an/a
Vanderbilt University Medical Center
Curated by ChEMBL
Assay Description
Activation of Kv7.1 channel expressed in CHO cells assessed as depolarization-induced thallium influx after 3 mins by patch clamp assay
Bioorg Med Chem Lett 22: 5936-41 (2012)
Article DOI: 10.1016/j.bmcl.2012.07.060
BindingDB Entry DOI: 10.7270/Q25T3MKN