BDBM50390884 CHEMBL2070976
SMILES: COc1ccc(cc1)-c1csc(NC(=O)[C@H]2CCCCN2S(=O)(=O)Cc2ccc(Cl)cc2)n1
InChI Key: InChIKey=JPZRKGHLOXQCMD-OAQYLSRUSA-N
Data: 1 EC50
Activity Spreadsheet -- Enzyme Inhibition Constant Data from BindingDB
Found 1 hit for monomerid = 50390884
Trg + Lig
Ki
nM
ΔG°
kcal/mole
IC50
nM
Kd
nM
EC50/IC50
nM
koff
s-1
kon
M-1s-1
pHTemp
°C
KCNQ (Kv7) potassium channel
(Homo sapiens (Human))
BDBM50390884
(CHEMBL2070976)
Show SMILES COc1ccc(cc1)-c1csc(NC(=O)[C@H]2CCCCN2S(=O)(=O)Cc2ccc(Cl)cc2)n1 |r|
Show InChI InChI=1S/C23H24ClN3O4S2/c1-31-19-11-7-17(8-12-19)20-14-32-23(25-20)26-22(28)21-4-2-3-13-27(21)33(29,30)15-16-5-9-18(24)10-6-16/h5-12,14,21H,2-4,13,15H2,1H3,(H,25,26,28)/t21-/m1/s1
Reactome pathway
n/an/an/an/a>3.00E+4n/an/an/an/a
Vanderbilt University Medical Center
Curated by ChEMBL
Assay Description
Activation of Kv7.1 channel expressed in CHO cells assessed as depolarization-induced thallium influx after 3 mins by patch clamp assay
Bioorg Med Chem Lett 22: 5936-41 (2012)
Article DOI: 10.1016/j.bmcl.2012.07.060
BindingDB Entry DOI: 10.7270/Q25T3MKN