BDBM50390898 CHEMBL2070992
SMILES: COc1ccc(cc1)-c1csc(NC(=O)CCNS(=O)(=O)c2ccc(C)cc2)n1
InChI Key: InChIKey=LXALJDUZPWJNTP-UHFFFAOYSA-N
Data: 1 EC50
Activity Spreadsheet -- Enzyme Inhibition Constant Data from BindingDB
Found 1 hit for monomerid = 50390898
Trg + Lig
Ki
nM
ΔG°
kcal/mole
IC50
nM
Kd
nM
EC50/IC50
nM
koff
s-1
kon
M-1s-1
pHTemp
°C
KCNQ (Kv7) potassium channel
(Homo sapiens (Human))
BDBM50390898
(CHEMBL2070992)
Show SMILES COc1ccc(cc1)-c1csc(NC(=O)CCNS(=O)(=O)c2ccc(C)cc2)n1
Show InChI InChI=1S/C20H21N3O4S2/c1-14-3-9-17(10-4-14)29(25,26)21-12-11-19(24)23-20-22-18(13-28-20)15-5-7-16(27-2)8-6-15/h3-10,13,21H,11-12H2,1-2H3,(H,22,23,24)
Reactome pathway
n/an/an/an/a>3.00E+4n/an/an/an/a
Vanderbilt University Medical Center
Curated by ChEMBL
Assay Description
Activation of Kv7.1 channel expressed in CHO cells assessed as depolarization-induced thallium influx after 3 mins by patch clamp assay
Bioorg Med Chem Lett 22: 5936-41 (2012)
Article DOI: 10.1016/j.bmcl.2012.07.060
BindingDB Entry DOI: 10.7270/Q25T3MKN