BDBM50390913 CHEMBL2071008
SMILES: Cc1ccc(cc1)S(=O)(=O)N1CCCC[C@@H]1C(=O)Nc1ncc(s1)-c1ccc2occc2c1
InChI Key: InChIKey=XVQJFVHWDUDYPT-HXUWFJFHSA-N
Data: 1 EC50
Activity Spreadsheet -- Enzyme Inhibition Constant Data from BindingDB
Found 1 hit for monomerid = 50390913
Trg + Lig
Ki
nM
ΔG°
kcal/mole
IC50
nM
Kd
nM
EC50/IC50
nM
koff
s-1
kon
M-1s-1
pHTemp
°C
KCNQ (Kv7) potassium channel
(Homo sapiens (Human))
BDBM50390913
(CHEMBL2071008)
Show SMILES Cc1ccc(cc1)S(=O)(=O)N1CCCC[C@@H]1C(=O)Nc1ncc(s1)-c1ccc2occc2c1 |r|
Show InChI InChI=1S/C24H23N3O4S2/c1-16-5-8-19(9-6-16)33(29,30)27-12-3-2-4-20(27)23(28)26-24-25-15-22(32-24)18-7-10-21-17(14-18)11-13-31-21/h5-11,13-15,20H,2-4,12H2,1H3,(H,25,26,28)/t20-/m1/s1
Reactome pathway
n/an/an/an/a>3.00E+4n/an/an/an/a
Vanderbilt University Medical Center
Curated by ChEMBL
Assay Description
Activation of Kv7.1 channel expressed in CHO cells assessed as depolarization-induced thallium influx after 3 mins by patch clamp assay
Bioorg Med Chem Lett 22: 5936-41 (2012)
Article DOI: 10.1016/j.bmcl.2012.07.060
BindingDB Entry DOI: 10.7270/Q25T3MKN