BDBM50390925 CHEMBL2070957
SMILES: COc1ccc(cc1)-c1csc(NC(=O)[C@H]2CCCCN2S(=O)(=O)c2ccccc2C(F)(F)F)n1
InChI Key: InChIKey=UOABDKNXSCKGLJ-LJQANCHMSA-N
Data: 1 EC50
Activity Spreadsheet -- Enzyme Inhibition Constant Data from BindingDB
Found 1 hit for monomerid = 50390925
Trg + Lig
Ki
nM
ΔG°
kcal/mole
IC50
nM
Kd
nM
EC50/IC50
nM
koff
s-1
kon
M-1s-1
pHTemp
°C
KCNQ (Kv7) potassium channel
(Homo sapiens (Human))
BDBM50390925
(CHEMBL2070957)
Show SMILES COc1ccc(cc1)-c1csc(NC(=O)[C@H]2CCCCN2S(=O)(=O)c2ccccc2C(F)(F)F)n1 |r|
Show InChI InChI=1S/C23H22F3N3O4S2/c1-33-16-11-9-15(10-12-16)18-14-34-22(27-18)28-21(30)19-7-4-5-13-29(19)35(31,32)20-8-3-2-6-17(20)23(24,25)26/h2-3,6,8-12,14,19H,4-5,7,13H2,1H3,(H,27,28,30)/t19-/m1/s1
Reactome pathway
n/an/an/an/a 4.74E+3n/an/an/an/a
Vanderbilt University Medical Center
Curated by ChEMBL
Assay Description
Activation of Kv7.1 channel expressed in CHO cells assessed as depolarization-induced thallium influx after 3 mins by patch clamp assay
Bioorg Med Chem Lett 22: 5936-41 (2012)
Article DOI: 10.1016/j.bmcl.2012.07.060
BindingDB Entry DOI: 10.7270/Q25T3MKN