BDBM50390946 CHEMBL2071034
SMILES: Cn1cc(N)nn1
InChI Key: InChIKey=SHCBWIXMCAIFMC-UHFFFAOYSA-N
Data: 1 KI  1 IC50
Activity Spreadsheet -- Enzyme Inhibition Constant Data from BindingDB
Found 2 hits for monomerid = 50390946
Trg + Lig
Ki
nM
ΔG°
kcal/mole
IC50
nM
Kd
nM
EC50/IC50
nM
koff
s-1
kon
M-1s-1
pHTemp
°C
Lysine-specific demethylase 4C
(Homo sapiens (Human))
BDBM50390946
(CHEMBL2071034)
Show SMILES Cn1cc(N)nn1
Show InChI InChI=1S/C3H6N4/c1-7-2-3(4)5-6-7/h2H,4H2,1H3
>2.00E+5n/an/an/an/an/an/an/an/a
University of Copenhagen
Curated by ChEMBL
Assay Description
Inhibition of KDM4C catalytic core-mediated demethylation of ARK(Me)3STGGK after 30 mins by FDH-coupled assay
Bioorg Med Chem Lett 22: 5811-3 (2012)
Article DOI: 10.1016/j.bmcl.2012.07.091
BindingDB Entry DOI: 10.7270/Q2222VV7
Lysine-specific demethylase 4C
(Homo sapiens (Human))
BDBM50390946
(CHEMBL2071034)
Show SMILES Cn1cc(N)nn1
Show InChI InChI=1S/C3H6N4/c1-7-2-3(4)5-6-7/h2H,4H2,1H3
n/an/a>2.00E+5n/an/an/an/an/an/a
University of Copenhagen
Curated by ChEMBL
Assay Description
Inhibition of KDM4C catalytic core-mediated demethylation of ARK(Me)3STGGK after 30 mins by FDH-coupled assay
Bioorg Med Chem Lett 22: 5811-3 (2012)
Article DOI: 10.1016/j.bmcl.2012.07.091
BindingDB Entry DOI: 10.7270/Q2222VV7