BDBM50390958 CHEMBL2071157
SMILES: [O-][n+]1nn(Cc2ccccc2)cc1Br
InChI Key: InChIKey=MGCVQBXYRUNNGB-UHFFFAOYSA-N
Data: 1 KI  1 IC50
Activity Spreadsheet -- Enzyme Inhibition Constant Data from BindingDB
Found 2 hits for monomerid = 50390958
Trg + Lig
Ki
nM
ΔG°
kcal/mole
IC50
nM
Kd
nM
EC50/IC50
nM
koff
s-1
kon
M-1s-1
pHTemp
°C
Lysine-specific demethylase 4C
(Homo sapiens (Human))
BDBM50390958
(CHEMBL2071157)
Show SMILES [O-][n+]1nn(Cc2ccccc2)cc1Br
Show InChI InChI=1S/C9H8BrN3O/c10-9-7-12(11-13(9)14)6-8-4-2-1-3-5-8/h1-5,7H,6H2
>2.00E+5n/an/an/an/an/an/an/an/a
University of Copenhagen
Curated by ChEMBL
Assay Description
Inhibition of KDM4C catalytic core-mediated demethylation of ARK(Me)3STGGK after 30 mins by FDH-coupled assay
Bioorg Med Chem Lett 22: 5811-3 (2012)
Article DOI: 10.1016/j.bmcl.2012.07.091
BindingDB Entry DOI: 10.7270/Q2222VV7
Lysine-specific demethylase 4C
(Homo sapiens (Human))
BDBM50390958
(CHEMBL2071157)
Show SMILES [O-][n+]1nn(Cc2ccccc2)cc1Br
Show InChI InChI=1S/C9H8BrN3O/c10-9-7-12(11-13(9)14)6-8-4-2-1-3-5-8/h1-5,7H,6H2
n/an/a>2.00E+5n/an/an/an/an/an/a
University of Copenhagen
Curated by ChEMBL
Assay Description
Inhibition of KDM4C catalytic core-mediated demethylation of ARK(Me)3STGGK after 30 mins by FDH-coupled assay
Bioorg Med Chem Lett 22: 5811-3 (2012)
Article DOI: 10.1016/j.bmcl.2012.07.091
BindingDB Entry DOI: 10.7270/Q2222VV7