BDBM50391037 CHEMBL2088403
SMILES: CC(C)(C)OCc1ccc(cc1)C(=O)Nc1ccc2sc(CO)nc2c1
InChI Key: InChIKey=YYEDEYQFMRQOSE-UHFFFAOYSA-N
Data: 1 IC50
Activity Spreadsheet -- Enzyme Inhibition Constant Data from BindingDB
Found 1 hit for monomerid = 50391037
Trg + Lig
Ki
nM
ΔG°
kcal/mole
IC50
nM
Kd
nM
EC50/IC50
nM
koff
s-1
kon
M-1s-1
pHTemp
°C
Transient receptor potential cation channel subfamily V member 1
(Homo sapiens (Human))
BDBM50391037
(CHEMBL2088403)
Show SMILES CC(C)(C)OCc1ccc(cc1)C(=O)Nc1ccc2sc(CO)nc2c1
Show InChI InChI=1S/C20H22N2O3S/c1-20(2,3)25-12-13-4-6-14(7-5-13)19(24)21-15-8-9-17-16(10-15)22-18(11-23)26-17/h4-10,23H,11-12H2,1-3H3,(H,21,24)
Reactome pathway
n/an/a 52n/an/an/an/an/an/a
AstraZeneca
Curated by ChEMBL
Assay Description
Antagonist activity at human recombinant TRPV1 receptor assessed as inhibition of capsaicin-induced calcium uptake by FLIPR assay
Bioorg Med Chem Lett 22: 6205-11 (2012)
Article DOI: 10.1016/j.bmcl.2012.08.018
BindingDB Entry DOI: 10.7270/Q29C6ZGB