BDBM50391055 CHEMBL2088399
SMILES: CC(C)(C)c1ccc(cc1)C(=O)Nc1ccc2sc(CO)nc2c1
InChI Key: InChIKey=QHYMGHKSWGRMLX-UHFFFAOYSA-N
Data: 1 IC50
Activity Spreadsheet -- Enzyme Inhibition Constant Data from BindingDB
Found 1 hit for monomerid = 50391055
Trg + Lig
Ki
nM
ΔG°
kcal/mole
IC50
nM
Kd
nM
EC50/IC50
nM
koff
s-1
kon
M-1s-1
pHTemp
°C
Transient receptor potential cation channel subfamily V member 1
(Homo sapiens (Human))
BDBM50391055
(CHEMBL2088399)
Show SMILES CC(C)(C)c1ccc(cc1)C(=O)Nc1ccc2sc(CO)nc2c1
Show InChI InChI=1S/C19H20N2O2S/c1-19(2,3)13-6-4-12(5-7-13)18(23)20-14-8-9-16-15(10-14)21-17(11-22)24-16/h4-10,22H,11H2,1-3H3,(H,20,23)
Reactome pathway
n/an/a 3.70n/an/an/an/an/an/a
AstraZeneca
Curated by ChEMBL
Assay Description
Antagonist activity at human recombinant TRPV1 receptor assessed as inhibition of capsaicin-induced calcium uptake by FLIPR assay
Bioorg Med Chem Lett 22: 6205-11 (2012)
Article DOI: 10.1016/j.bmcl.2012.08.018
BindingDB Entry DOI: 10.7270/Q29C6ZGB