BDBM50391057 CHEMBL2088422
SMILES: COc1cccc(NC(=O)N(CCCCC2CCCCC2)CCc2ccc(SC(C)(C)C(O)=O)cc2)c1
InChI Key: InChIKey=ZUEQERZRCCIEQQ-UHFFFAOYSA-N
Data: 1 IC50
Activity Spreadsheet -- Enzyme Inhibition Constant Data from BindingDB
Found 1 hit for monomerid = 50391057
Trg + Lig
Ki
nM
ΔG°
kcal/mole
IC50
nM
Kd
nM
EC50/IC50
nM
koff
s-1
kon
M-1s-1
pHTemp
°C
Peroxisome proliferator-activated receptor alpha (PPAR alpha)
(Homo sapiens (Human))
BDBM50391057
(CHEMBL2088422)
Show SMILES COc1cccc(NC(=O)N(CCCCC2CCCCC2)CCc2ccc(SC(C)(C)C(O)=O)cc2)c1
Show InChI InChI=1S/C30H42N2O4S/c1-30(2,28(33)34)37-27-17-15-24(16-18-27)19-21-32(20-8-7-12-23-10-5-4-6-11-23)29(35)31-25-13-9-14-26(22-25)36-3/h9,13-18,22-23H,4-8,10-12,19-21H2,1-3H3,(H,31,35)(H,33,34)
n/an/a 0.590n/an/an/an/an/an/a
Washington University School of Medicine
Curated by ChEMBL
Assay Description
Agonist activity at PPARalpha-LBD expressed in HEK293 cells co-expressing GAL4-DBD after 16 to 19 hrs by beta lactamase reporter gene assay
Bioorg Med Chem Lett 22: 6233-6 (2012)
Article DOI: 10.1016/j.bmcl.2012.08.010
BindingDB Entry DOI: 10.7270/Q25M66SF