BDBM50391196 CHEMBL2088674
SMILES: COc1ccc2n(Cc3ccc(cc3)C#N)c3c(c(C)n[nH]c3=O)c2c1
InChI Key: InChIKey=XDUQZNNLJAJYJR-UHFFFAOYSA-N
Data: 3 IC50
Activity Spreadsheet -- Enzyme Inhibition Constant Data from BindingDB
Found 3 hits for monomerid = 50391196
Trg + Lig
Ki
nM
ΔG°
kcal/mole
IC50
nM
Kd
nM
EC50/IC50
nM
koff
s-1
kon
M-1s-1
pHTemp
°C
Dual specificity tyrosine-phosphorylation-regulated kinase 1A
(RAT)
BDBM50391196
(CHEMBL2088674)
Show SMILES COc1ccc2n(Cc3ccc(cc3)C#N)c3c(c(C)n[nH]c3=O)c2c1
Show InChI InChI=1S/C20H16N4O2/c1-12-18-16-9-15(26-2)7-8-17(16)24(19(18)20(25)23-22-12)11-14-5-3-13(10-21)4-6-14/h3-9H,11H2,1-2H3,(H,23,25)
n/an/a>1.00E+4n/an/an/an/an/an/a
Universit£ de Nantes
Curated by ChEMBL
Assay Description
Inhibition of rat recombinant GST-tagged DYRK1A expressed in Escherichia coli using myelin basic protein substrate
Eur J Med Chem 57: 225-33 (2012)
Article DOI: 10.1016/j.ejmech.2012.09.001
BindingDB Entry DOI: 10.7270/Q2RF5W4C
Phosphatidylinositol 3-kinase regulatory subunit alpha/4,5-bisphosphate 3-kinase catalytic subunit alpha isoform
(Homo sapiens (Human))
BDBM50391196
(CHEMBL2088674)
Show SMILES COc1ccc2n(Cc3ccc(cc3)C#N)c3c(c(C)n[nH]c3=O)c2c1
Show InChI InChI=1S/C20H16N4O2/c1-12-18-16-9-15(26-2)7-8-17(16)24(19(18)20(25)23-22-12)11-14-5-3-13(10-21)4-6-14/h3-9H,11H2,1-2H3,(H,23,25)
n/an/a 2.90E+3n/an/an/an/an/an/a
Universit£ de Nantes
Curated by ChEMBL
Assay Description
Inhibition of PI3K p110alpha/p85alpha by fluorescence based immunoassay
Eur J Med Chem 57: 225-33 (2012)
Article DOI: 10.1016/j.ejmech.2012.09.001
BindingDB Entry DOI: 10.7270/Q2RF5W4C
Cyclin-dependent kinase 5 activator 1
(Homo sapiens (Human))
BDBM50391196
(CHEMBL2088674)
Show SMILES COc1ccc2n(Cc3ccc(cc3)C#N)c3c(c(C)n[nH]c3=O)c2c1
Show InChI InChI=1S/C20H16N4O2/c1-12-18-16-9-15(26-2)7-8-17(16)24(19(18)20(25)23-22-12)11-14-5-3-13(10-21)4-6-14/h3-9H,11H2,1-2H3,(H,23,25)
NCI pathway
Reactome pathway
n/an/a>1.00E+4n/an/an/an/an/an/a
Universit£ de Nantes
Curated by ChEMBL
Assay Description
Inhibition of human recombinant CDK5/P25 using myelin basic protein substrate
Eur J Med Chem 57: 225-33 (2012)
Article DOI: 10.1016/j.ejmech.2012.09.001
BindingDB Entry DOI: 10.7270/Q2RF5W4C