BDBM50391361 CHEMBL2147996
SMILES: Fc1cc(ccn1)-c1c[nH]nn1
InChI Key: InChIKey=COPWSNUMYYPDFZ-UHFFFAOYSA-N
Data: 5 IC50
Activity Spreadsheet -- Enzyme Inhibition Constant Data from BindingDB
Found 5 hits for monomerid = 50391361
Trg + Lig
Ki
nM
ΔG°
kcal/mole
IC50
nM
Kd
nM
EC50/IC50
nM
koff
s-1
kon
M-1s-1
pHTemp
°C
Indoleamine 2,3-dioxygenase 1
(Mus musculus)
BDBM50391361
(CHEMBL2147996)
Show SMILES Fc1cc(ccn1)-c1c[nH]nn1
Show InChI InChI=1S/C7H5FN4/c8-7-3-5(1-2-9-7)6-4-10-12-11-6/h1-4H,(H,10,11,12)
Reactome pathway
n/an/a 120n/an/an/an/an/an/a
Ludwig Center for Cancer Research of the University of Lausanne
Curated by ChEMBL
Assay Description
Inhibition of mouse IDO1 in P815 clone 6 cells by HPLC analysis
J Med Chem 55: 5270-90 (2012)
Article DOI: 10.1021/jm300260v
BindingDB Entry DOI: 10.7270/Q27H1KNW
Indoleamine 2,3-dioxygenase
(Homo sapiens (Human))
BDBM50391361
(CHEMBL2147996)
Show SMILES Fc1cc(ccn1)-c1c[nH]nn1
Show InChI InChI=1S/C7H5FN4/c8-7-3-5(1-2-9-7)6-4-10-12-11-6/h1-4H,(H,10,11,12)
Reactome pathway
n/an/a 7.00E+3n/an/an/an/an/an/a
Ludwig Center for Cancer Research of the University of Lausanne
Curated by ChEMBL
Assay Description
Inhibition of human IDO1 transfected in mouse P815B clone-6 cells by HPLC analysis
J Med Chem 55: 5270-90 (2012)
Article DOI: 10.1021/jm300260v
BindingDB Entry DOI: 10.7270/Q27H1KNW
Indoleamine 2,3-dioxygenase
(Homo sapiens (Human))
BDBM50391361
(CHEMBL2147996)
Show SMILES Fc1cc(ccn1)-c1c[nH]nn1
Show InChI InChI=1S/C7H5FN4/c8-7-3-5(1-2-9-7)6-4-10-12-11-6/h1-4H,(H,10,11,12)
Reactome pathway
n/an/a 7.40E+3n/an/an/an/a6.5n/a
Ludwig Center for Cancer Research of the University of Lausanne
Curated by ChEMBL
Assay Description
Inhibition of human recombinant N-terminal His-tagged IDO1 (Ala2 to Gly403) overexpressed in Escherichia coli BL21 at pH 6.5 after 60 mins by HPLC an...
J Med Chem 55: 5270-90 (2012)
Article DOI: 10.1021/jm300260v
BindingDB Entry DOI: 10.7270/Q27H1KNW
Tryptophan 2,3-dioxygenase
(Homo sapiens (Human))
BDBM50391361
(CHEMBL2147996)
Show SMILES Fc1cc(ccn1)-c1c[nH]nn1
Show InChI InChI=1S/C7H5FN4/c8-7-3-5(1-2-9-7)6-4-10-12-11-6/h1-4H,(H,10,11,12)
Reactome pathway
n/an/a>1.00E+5n/an/an/an/an/an/a
Ludwig Center for Cancer Research of the University of Lausanne
Curated by ChEMBL
Assay Description
Inhibition of human TDO transfected in mouse P815B clone 19 cells by HPLC analysis
J Med Chem 55: 5270-90 (2012)
Article DOI: 10.1021/jm300260v
BindingDB Entry DOI: 10.7270/Q27H1KNW
Tryptophan 2,3-dioxygenase
(Mus musculus)
BDBM50391361
(CHEMBL2147996)
Show SMILES Fc1cc(ccn1)-c1c[nH]nn1
Show InChI InChI=1S/C7H5FN4/c8-7-3-5(1-2-9-7)6-4-10-12-11-6/h1-4H,(H,10,11,12)
Reactome pathway
n/an/a>1.00E+5n/an/an/an/an/an/a
Ludwig Center for Cancer Research of the University of Lausanne
Curated by ChEMBL
Assay Description
Inhibition of mouse TDO in P815 clone 12 cells by HPLC analysis
J Med Chem 55: 5270-90 (2012)
Article DOI: 10.1021/jm300260v
BindingDB Entry DOI: 10.7270/Q27H1KNW