BDBM50391366 CHEMBL2147991
SMILES: FC(F)(F)c1cccc(c1)-c1c[nH]nn1
InChI Key: InChIKey=FVJUPJOHXUBGLQ-UHFFFAOYSA-N
Data: 5 IC50
Activity Spreadsheet -- Enzyme Inhibition Constant Data from BindingDB
Found 5 hits for monomerid = 50391366
Trg + Lig
Ki
nM
ΔG°
kcal/mole
IC50
nM
Kd
nM
EC50/IC50
nM
koff
s-1
kon
M-1s-1
pHTemp
°C
Indoleamine 2,3-dioxygenase 1
(Mus musculus)
BDBM50391366
(CHEMBL2147991)
Show SMILES FC(F)(F)c1cccc(c1)-c1c[nH]nn1
Show InChI InChI=1S/C9H6F3N3/c10-9(11,12)7-3-1-2-6(4-7)8-5-13-15-14-8/h1-5H,(H,13,14,15)
Reactome pathway
n/an/a 70n/an/an/an/an/an/a
Ludwig Center for Cancer Research of the University of Lausanne
Curated by ChEMBL
Assay Description
Inhibition of mouse IDO1 in P815 clone 6 cells by HPLC analysis
J Med Chem 55: 5270-90 (2012)
Article DOI: 10.1021/jm300260v
BindingDB Entry DOI: 10.7270/Q27H1KNW
Indoleamine 2,3-dioxygenase
(Homo sapiens (Human))
BDBM50391366
(CHEMBL2147991)
Show SMILES FC(F)(F)c1cccc(c1)-c1c[nH]nn1
Show InChI InChI=1S/C9H6F3N3/c10-9(11,12)7-3-1-2-6(4-7)8-5-13-15-14-8/h1-5H,(H,13,14,15)
Reactome pathway
n/an/a 9.00E+3n/an/an/an/an/an/a
Ludwig Center for Cancer Research of the University of Lausanne
Curated by ChEMBL
Assay Description
Inhibition of human IDO1 transfected in mouse P815B clone-6 cells by HPLC analysis
J Med Chem 55: 5270-90 (2012)
Article DOI: 10.1021/jm300260v
BindingDB Entry DOI: 10.7270/Q27H1KNW
Indoleamine 2,3-dioxygenase
(Homo sapiens (Human))
BDBM50391366
(CHEMBL2147991)
Show SMILES FC(F)(F)c1cccc(c1)-c1c[nH]nn1
Show InChI InChI=1S/C9H6F3N3/c10-9(11,12)7-3-1-2-6(4-7)8-5-13-15-14-8/h1-5H,(H,13,14,15)
Reactome pathway
n/an/a 6.00E+3n/an/an/an/a6.5n/a
Ludwig Center for Cancer Research of the University of Lausanne
Curated by ChEMBL
Assay Description
Inhibition of human recombinant N-terminal His-tagged IDO1 (Ala2 to Gly403) overexpressed in Escherichia coli BL21 at pH 6.5 after 60 mins by HPLC an...
J Med Chem 55: 5270-90 (2012)
Article DOI: 10.1021/jm300260v
BindingDB Entry DOI: 10.7270/Q27H1KNW
Tryptophan 2,3-dioxygenase
(Homo sapiens (Human))
BDBM50391366
(CHEMBL2147991)
Show SMILES FC(F)(F)c1cccc(c1)-c1c[nH]nn1
Show InChI InChI=1S/C9H6F3N3/c10-9(11,12)7-3-1-2-6(4-7)8-5-13-15-14-8/h1-5H,(H,13,14,15)
Reactome pathway
n/an/a>1.00E+5n/an/an/an/an/an/a
Ludwig Center for Cancer Research of the University of Lausanne
Curated by ChEMBL
Assay Description
Inhibition of human TDO transfected in mouse P815B clone 19 cells by HPLC analysis
J Med Chem 55: 5270-90 (2012)
Article DOI: 10.1021/jm300260v
BindingDB Entry DOI: 10.7270/Q27H1KNW
Tryptophan 2,3-dioxygenase
(Mus musculus)
BDBM50391366
(CHEMBL2147991)
Show SMILES FC(F)(F)c1cccc(c1)-c1c[nH]nn1
Show InChI InChI=1S/C9H6F3N3/c10-9(11,12)7-3-1-2-6(4-7)8-5-13-15-14-8/h1-5H,(H,13,14,15)
Reactome pathway
n/an/a>1.00E+5n/an/an/an/an/an/a
Ludwig Center for Cancer Research of the University of Lausanne
Curated by ChEMBL
Assay Description
Inhibition of mouse TDO in P815 clone 12 cells by HPLC analysis
J Med Chem 55: 5270-90 (2012)
Article DOI: 10.1021/jm300260v
BindingDB Entry DOI: 10.7270/Q27H1KNW