BDBM50391369 CHEMBL2148075
SMILES: Cc1ccc(Cl)cc1-c1c[nH]nn1
InChI Key: InChIKey=CEULKLHKLQOZEL-UHFFFAOYSA-N
Data: 5 IC50
Activity Spreadsheet -- Enzyme Inhibition Constant Data from BindingDB
Found 5 hits for monomerid = 50391369
Trg + Lig
Ki
nM
ΔG°
kcal/mole
IC50
nM
Kd
nM
EC50/IC50
nM
koff
s-1
kon
M-1s-1
pHTemp
°C
Indoleamine 2,3-dioxygenase
(Homo sapiens (Human))
BDBM50391369
(CHEMBL2148075)
Show SMILES Cc1ccc(Cl)cc1-c1c[nH]nn1
Show InChI InChI=1S/C9H8ClN3/c1-6-2-3-7(10)4-8(6)9-5-11-13-12-9/h2-5H,1H3,(H,11,12,13)
Reactome pathway
n/an/a 1.40E+4n/an/an/an/an/an/a
Ludwig Center for Cancer Research of the University of Lausanne
Curated by ChEMBL
Assay Description
Inhibition of human IDO1 transfected in mouse P815B clone-6 cells by HPLC analysis
J Med Chem 55: 5270-90 (2012)
Article DOI: 10.1021/jm300260v
BindingDB Entry DOI: 10.7270/Q27H1KNW
Indoleamine 2,3-dioxygenase 1
(Mus musculus)
BDBM50391369
(CHEMBL2148075)
Show SMILES Cc1ccc(Cl)cc1-c1c[nH]nn1
Show InChI InChI=1S/C9H8ClN3/c1-6-2-3-7(10)4-8(6)9-5-11-13-12-9/h2-5H,1H3,(H,11,12,13)
Reactome pathway
n/an/a 120n/an/an/an/an/an/a
Ludwig Center for Cancer Research of the University of Lausanne
Curated by ChEMBL
Assay Description
Inhibition of mouse IDO1 in P815 clone 6 cells by HPLC analysis
J Med Chem 55: 5270-90 (2012)
Article DOI: 10.1021/jm300260v
BindingDB Entry DOI: 10.7270/Q27H1KNW
Indoleamine 2,3-dioxygenase
(Homo sapiens (Human))
BDBM50391369
(CHEMBL2148075)
Show SMILES Cc1ccc(Cl)cc1-c1c[nH]nn1
Show InChI InChI=1S/C9H8ClN3/c1-6-2-3-7(10)4-8(6)9-5-11-13-12-9/h2-5H,1H3,(H,11,12,13)
Reactome pathway
n/an/a 4.30E+3n/an/an/an/a6.5n/a
Ludwig Center for Cancer Research of the University of Lausanne
Curated by ChEMBL
Assay Description
Inhibition of human recombinant N-terminal His-tagged IDO1 (Ala2 to Gly403) overexpressed in Escherichia coli BL21 at pH 6.5 after 60 mins by HPLC an...
J Med Chem 55: 5270-90 (2012)
Article DOI: 10.1021/jm300260v
BindingDB Entry DOI: 10.7270/Q27H1KNW
Tryptophan 2,3-dioxygenase
(Mus musculus)
BDBM50391369
(CHEMBL2148075)
Show SMILES Cc1ccc(Cl)cc1-c1c[nH]nn1
Show InChI InChI=1S/C9H8ClN3/c1-6-2-3-7(10)4-8(6)9-5-11-13-12-9/h2-5H,1H3,(H,11,12,13)
Reactome pathway
n/an/a>1.00E+5n/an/an/an/an/an/a
Ludwig Center for Cancer Research of the University of Lausanne
Curated by ChEMBL
Assay Description
Inhibition of mouse TDO in P815 clone 12 cells by HPLC analysis
J Med Chem 55: 5270-90 (2012)
Article DOI: 10.1021/jm300260v
BindingDB Entry DOI: 10.7270/Q27H1KNW
Tryptophan 2,3-dioxygenase
(Homo sapiens (Human))
BDBM50391369
(CHEMBL2148075)
Show SMILES Cc1ccc(Cl)cc1-c1c[nH]nn1
Show InChI InChI=1S/C9H8ClN3/c1-6-2-3-7(10)4-8(6)9-5-11-13-12-9/h2-5H,1H3,(H,11,12,13)
Reactome pathway
n/an/a>1.00E+5n/an/an/an/an/an/a
Ludwig Center for Cancer Research of the University of Lausanne
Curated by ChEMBL
Assay Description
Inhibition of human TDO transfected in mouse P815B clone 19 cells by HPLC analysis
J Med Chem 55: 5270-90 (2012)
Article DOI: 10.1021/jm300260v
BindingDB Entry DOI: 10.7270/Q27H1KNW