null
SMILES: OCCN(Cc1ccc(O)cc1)Cc1coc2cccc(OCC3CCCCC3)c2c1=O
InChI Key: InChIKey=GYKLAJKYSFJKJS-UHFFFAOYSA-N
Activity Spreadsheet -- Enzyme Inhibition Constant Data from BindingDB
Found 1 hit for monomerid = 50391547
Trg + Lig
Ki
nM
ΔG°
kcal/mole
IC50
nM
Kd
nM
EC50/IC50
nM
koff
s-1
kon
M-1s-1
pHTemp
°C
Interleukin-5
(Mus musculus)
BDBM50391547
(CHEMBL2147499)
Show SMILES OCCN(Cc1ccc(O)cc1)Cc1coc2cccc(OCC3CCCCC3)c2c1=O
Show InChI InChI=1S/C26H31NO5/c28-14-13-27(15-19-9-11-22(29)12-10-19)16-21-18-32-24-8-4-7-23(25(24)26(21)30)31-17-20-5-2-1-3-6-20/h4,7-12,18,20,28-29H,1-3,5-6,13-17H2
Reactome pathway
n/an/a 9.10E+3n/an/an/an/an/an/a
Chungnam National University
Curated by ChEMBL
Assay Description
Inhibition of IL-5 in mouse Y16 cells after 48 hrs by WST1 assay
Bioorg Med Chem 20: 5757-62 (2012)
Article DOI: 10.1016/j.bmc.2012.08.006
BindingDB Entry DOI: 10.7270/Q2PG1SSV