BDBM50391554 CHEMBL2147492
SMILES: CCCCN(CCO)Cc1coc2cccc(OCC3CCCCC3)c2c1=O
InChI Key: InChIKey=OYSISJFKVUIECM-UHFFFAOYSA-N
Data: 1 IC50
Activity Spreadsheet -- Enzyme Inhibition Constant Data from BindingDB
Found 1 hit for monomerid = 50391554
Trg + Lig
Ki
nM
ΔG°
kcal/mole
IC50
nM
Kd
nM
EC50/IC50
nM
koff
s-1
kon
M-1s-1
pHTemp
°C
Interleukin-5
(Mus musculus)
BDBM50391554
(CHEMBL2147492)
Show SMILES CCCCN(CCO)Cc1coc2cccc(OCC3CCCCC3)c2c1=O
Show InChI InChI=1S/C23H33NO4/c1-2-3-12-24(13-14-25)15-19-17-28-21-11-7-10-20(22(21)23(19)26)27-16-18-8-5-4-6-9-18/h7,10-11,17-18,25H,2-6,8-9,12-16H2,1H3
Reactome pathway
n/an/a 9.20E+3n/an/an/an/an/an/a
Chungnam National University
Curated by ChEMBL
Assay Description
Inhibition of IL-5 in mouse Y16 cells after 48 hrs by WST1 assay
Bioorg Med Chem 20: 5757-62 (2012)
Article DOI: 10.1016/j.bmc.2012.08.006
BindingDB Entry DOI: 10.7270/Q2PG1SSV