BDBM50391722 CHEMBL2146981
SMILES: COC(=O)C(C)(C)C(c1ccc(Nc2ccc(cc2)C(F)(F)F)cc1)n1ccnc1
InChI Key: InChIKey=OHMKSXJKGQBWMU-UHFFFAOYSA-N
Data: 1 IC50
Activity Spreadsheet -- Enzyme Inhibition Constant Data from BindingDB
Found 1 hit for monomerid = 50391722
Trg + Lig
Ki
nM
ΔG°
kcal/mole
IC50
nM
Kd
nM
EC50/IC50
nM
koff
s-1
kon
M-1s-1
pHTemp
°C
Cytochrome CYP26A1
(Homo sapiens (Human))
BDBM50391722
(CHEMBL2146981)
Show SMILES COC(=O)C(C)(C)C(c1ccc(Nc2ccc(cc2)C(F)(F)F)cc1)n1ccnc1
Show InChI InChI=1S/C22H22F3N3O2/c1-21(2,20(29)30-3)19(28-13-12-26-14-28)15-4-8-17(9-5-15)27-18-10-6-16(7-11-18)22(23,24)25/h4-14,19,27H,1-3H3
Reactome pathway
n/an/a 9.40n/an/an/an/an/an/a
Cardiff University
Curated by ChEMBL
Assay Description
Inhibition of CYP26A1-mediated retionic acid metabolism in human MCF7 cell microsomes using [3H]ATRA as substrate after 1 hr by scintillation countin...
Bioorg Med Chem 20: 6080-8 (2012)
Article DOI: 10.1016/j.bmc.2012.08.044
BindingDB Entry DOI: 10.7270/Q2D21ZQD