BDBM50391728 CHEMBL2147090
SMILES: COC(=O)C(C)(C)C(c1ccc(Nc2ccc3OCOc3c2)cc1)n1cncn1
InChI Key: InChIKey=PZQXYXCVPHEJQB-UHFFFAOYSA-N
Data: 1 IC50
Activity Spreadsheet -- Enzyme Inhibition Constant Data from BindingDB
Found 1 hit for monomerid = 50391728
Trg + Lig
Ki
nM
ΔG°
kcal/mole
IC50
nM
Kd
nM
EC50/IC50
nM
koff
s-1
kon
M-1s-1
pHTemp
°C
Cytochrome CYP26A1
(Homo sapiens (Human))
BDBM50391728
(CHEMBL2147090)
Show SMILES COC(=O)C(C)(C)C(c1ccc(Nc2ccc3OCOc3c2)cc1)n1cncn1
Show InChI InChI=1S/C21H22N4O4/c1-21(2,20(26)27-3)19(25-12-22-11-23-25)14-4-6-15(7-5-14)24-16-8-9-17-18(10-16)29-13-28-17/h4-12,19,24H,13H2,1-3H3
Reactome pathway
n/an/a 6.70n/an/an/an/an/an/a
Cardiff University
Curated by ChEMBL
Assay Description
Inhibition of CYP26A1-mediated retionic acid metabolism in human MCF7 cell microsomes using [3H]ATRA as substrate after 1 hr by scintillation countin...
Bioorg Med Chem 20: 6080-8 (2012)
Article DOI: 10.1016/j.bmc.2012.08.044
BindingDB Entry DOI: 10.7270/Q2D21ZQD