BDBM50391729 CHEMBL2147091
SMILES: COC(=O)C(C)(C)C(c1ccc(Nc2ccccc2)cc1)n1ccnc1C
InChI Key: InChIKey=DAOUUETWFUNFOI-UHFFFAOYSA-N
Data: 1 IC50
Activity Spreadsheet -- Enzyme Inhibition Constant Data from BindingDB
Found 1 hit for monomerid = 50391729
Trg + Lig
Ki
nM
ΔG°
kcal/mole
IC50
nM
Kd
nM
EC50/IC50
nM
koff
s-1
kon
M-1s-1
pHTemp
°C
Cytochrome CYP26A1
(Homo sapiens (Human))
BDBM50391729
(CHEMBL2147091)
Show SMILES COC(=O)C(C)(C)C(c1ccc(Nc2ccccc2)cc1)n1ccnc1C
Show InChI InChI=1S/C22H25N3O2/c1-16-23-14-15-25(16)20(22(2,3)21(26)27-4)17-10-12-19(13-11-17)24-18-8-6-5-7-9-18/h5-15,20,24H,1-4H3
Reactome pathway
n/an/a 90n/an/an/an/an/an/a
Cardiff University
Curated by ChEMBL
Assay Description
Inhibition of CYP26A1-mediated retionic acid metabolism in human MCF7 cell microsomes using [3H]ATRA as substrate after 1 hr by scintillation countin...
Bioorg Med Chem 20: 6080-8 (2012)
Article DOI: 10.1016/j.bmc.2012.08.044
BindingDB Entry DOI: 10.7270/Q2D21ZQD