BDBM50391791 CHEMBL2146853
SMILES: [O-][N+](=O)c1ccc(CCN2CCN(CCc3ccc4[n-][o+]nc4c3)CC2)cc1
InChI Key: InChIKey=SEWIXNYQXNASBQ-UHFFFAOYSA-N
Data: 2 IC50
Activity Spreadsheet -- Enzyme Inhibition Constant Data from BindingDB
Found 2 hits for monomerid = 50391791
Trg + Lig
Ki
nM
ΔG°
kcal/mole
IC50
nM
Kd
nM
EC50/IC50
nM
koff
s-1
kon
M-1s-1
pHTemp
°C
Potassium voltage-gated channel subfamily H member 2
(Homo sapiens (Human))
BDBM50391791
(CHEMBL2146853)
Show SMILES [O-][N+](=O)c1ccc(CCN2CCN(CCc3ccc4[n-][o+]nc4c3)CC2)cc1
Show InChI InChI=1S/C20H23N5O3/c26-25(27)18-4-1-16(2-5-18)7-9-23-11-13-24(14-12-23)10-8-17-3-6-19-20(15-17)22-28-21-19/h1-6,15H,7-14H2
Reactome pathway
n/an/a 25n/an/an/an/an/an/a
TBA
Curated by ChEMBL
Assay Description
Displacement of [35S]MK499 from human ERG
ACS Med Chem Lett 3: 367-372 (2012)
Article DOI: 10.1021/ml3000066
BindingDB Entry DOI: 10.7270/Q2MK6DZV
ATP-sensitive inward rectifier potassium channel 1
(Homo sapiens (Human))
BDBM50391791
(CHEMBL2146853)
Show SMILES [O-][N+](=O)c1ccc(CCN2CCN(CCc3ccc4[n-][o+]nc4c3)CC2)cc1
Show InChI InChI=1S/C20H23N5O3/c26-25(27)18-4-1-16(2-5-18)7-9-23-11-13-24(14-12-23)10-8-17-3-6-19-20(15-17)22-28-21-19/h1-6,15H,7-14H2
Reactome pathway
n/an/a 170n/an/an/an/an/an/a
TBA
Curated by ChEMBL
Assay Description
Inhibition of human ROMK1 channel expressed in CHO cells coexpressing DHFR assessed as inhibition of 86Rb+ efflux after 35 mins by TopCount method
ACS Med Chem Lett 3: 367-372 (2012)
Article DOI: 10.1021/ml3000066
BindingDB Entry DOI: 10.7270/Q2MK6DZV